VAS. A Semantic Model for Earth Observation Remote Sensing
type: Ontology
version IRI: https://robotica.uv.es/proyectos/ASOTVAS/def/ciencia-tecnologia/vas/1.1.0
contributor: David Garcia-Rodriguez (https://orcid.org/0000-0002-1472-5497), Ernesto López-Baeza (https://orcid.org/0000-0002-2044-2194), Julián Gutiérrez-Moret (https://orcid.org/0000-0002-0817-7922) & Juan José Martínez-Durá (https://orcid.org/0000-0002-7218-991X)
creator: J. Javier Samper Zapater (https://orcid.org/0000-0002-9170-3080) IRTIC - (Instituto de Robótica y Tecnologías de la Información y la Comunicación)
description: The VAS ontological model enables the semantic integration of the heterogeneous observations used in ASOTVAS project ( https://robotica.uv.es/proyectos/ASOTVAS/ ), including ground measurements, UAV acquisitions and satellite products. Built as an extension of the W3C SOSA ontology (Janowicz et al., 2018), it incorporates a domain-specific vocabulary tailored to the needs of the Valencia Anchor Station as a CEOS LPV supersite. The model provides additional classes and properties to represent, in a homogeneous way, the different observational platforms: field sensors installed at VAS stations, UAVs equipped with multispectral cameras, and satellite missions such as Sentinel-2 and Sentinel-3. All observations follow a common SOSA pattern and share the same structure for results, units and timestamps. By aligning field, UAV and satellite observations under a unified semantic framework, the VAS ontology supports interoperable data access, consistent representation across scales, and integrated analysis of the multi-source measurements collected in ASOTVAS.
issued: 2024-10-10
license: https://creativecommons.org/licenses/by/4.0/
modified: 2025-11-28
publisher: IRTIC - (Instituto de Robótica y Tecnologías de la Información y la Comunicación) @es
preferred namespace prefix: vas
preferred namespace uri: https://robotica.uv.es/proyectos/ASOTVAS/def/ciencia-tecnologia/vas#
see also: J. Javier Samper-Zapater, Juan J. Martinez-Dura, Javier Martinez-Plume, David García Rodríguez, Julian Gutiérrez Moret, and Ernesto López Baeza. 2025. VAS. A Semantic Model for Earth Observation data. In Proceedings of the 12th Euro American Conference on Telematics and Information Systems (EATIS 2024). Association for Computing Machinery, New York, NY, USA, Article 9, 1–8. https://doi.org/10.1145/3685243.3685295
version info: 1.1 @es
change note: New revised and updated version of the ontology with information on data capture using UAVs. Ontology version 1.1 28th November 2025.
type: NamedIndividual

Contributor
type: AnnotationProperty
description: The guidelines for using names of persons or organizations as creators also apply to contributors. Typically, the name of a Contributor should be used to indicate the entity.
issued: 1999-07-02
comment: An entity responsible for making contributions to the resource.
note: A [second property](/specifications/dublin-core/dcmi-terms/#http://purl.org/dc/terms/contributor) with the same name as this property has been declared in the [dcterms: namespace](http://purl.org/dc/terms/). See the Introduction to the document [DCMI Metadata Terms](/specifications/dublin-core/dcmi-terms/) for an explanation.

Creator
type: AnnotationProperty
description: Examples of a Creator include a person, an organization, or a service. Typically, the name of a Creator should be used to indicate the entity.
issued: 1999-07-02
comment: An entity primarily responsible for making the resource.
note: A [second property](/specifications/dublin-core/dcmi-terms/#http://purl.org/dc/terms/creator) with the same name as this property has been declared in the [dcterms: namespace](http://purl.org/dc/terms/). See the Introduction to the document [DCMI Metadata Terms](/specifications/dublin-core/dcmi-terms/) for an explanation.

Date
type: AnnotationProperty
description: Date may be used to express temporal information at any level of granularity. Recommended practice is to express the date, date/time, or period of time according to ISO 8601-1 [[ISO 8601-1](https://www.iso.org/iso-8601-date-and-time-format.html)] or a published profile of the ISO standard, such as the W3C Note on Date and Time Formats [[W3CDTF](https://www.w3.org/TR/NOTE-datetime)] or the Extended Date/Time Format Specification [[EDTF](http://www.loc.gov/standards/datetime/)]. If the full date is unknown, month and year (YYYY-MM) or just year (YYYY) may be used. Date ranges may be specified using ISO 8601 period of time specification in which start and end dates are separated by a '/' (slash) character. Either the start or end date may be missing.
issued: 1999-07-02
comment: A point or period of time associated with an event in the lifecycle of the resource.
note: A [second property](/specifications/dublin-core/dcmi-terms/#http://purl.org/dc/terms/date) with the same name as this property has been declared in the [dcterms: namespace](http://purl.org/dc/terms/). See the Introduction to the document [DCMI Metadata Terms](/specifications/dublin-core/dcmi-terms/) for an explanation.

Description
type: AnnotationProperty
description: Description may include but is not limited to: an abstract, a table of contents, a graphical representation, or a free-text account of the resource.
issued: 1999-07-02
comment: An account of the resource.
note: A [second property](/specifications/dublin-core/dcmi-terms/#http://purl.org/dc/terms/description) with the same name as this property has been declared in the [dcterms: namespace](http://purl.org/dc/terms/). See the Introduction to the document [DCMI Metadata Terms](/specifications/dublin-core/dcmi-terms/) for an explanation.

Source
type: AnnotationProperty
description: The described resource may be derived from the related resource in whole or in part. Recommended best practice is to identify the related resource by means of a string conforming to a formal identification system.
issued: 1999-07-02
comment: A related resource from which the described resource is derived.
note: A [second property](/specifications/dublin-core/dcmi-terms/#http://purl.org/dc/terms/source) with the same name as this property has been declared in the [dcterms: namespace](http://purl.org/dc/terms/). See the Introduction to the document [DCMI Metadata Terms](/specifications/dublin-core/dcmi-terms/) for an explanation.

Title
type: AnnotationProperty
issued: 1999-07-02
comment: A name given to the resource.
note: A [second property](/specifications/dublin-core/dcmi-terms/#http://purl.org/dc/terms/title) with the same name as this property has been declared in the [dcterms: namespace](http://purl.org/dc/terms/). See the Introduction to the document [DCMI Metadata Terms](/specifications/dublin-core/dcmi-terms/) for an explanation.

alternative label
type: AnnotationProperty
comment: The range of skos:altLabel is the class of RDF plain literals.
comment: skos:prefLabel, skos:altLabel and skos:hiddenLabel are pairwise disjoint properties.
definition: An alternative lexical label for a resource.
example: Acronyms, abbreviations, spelling variants, and irregular plural/singular forms may be included among the alternative labels for a concept. Mis-spelled terms are normally included as hidden labels (see skos:hiddenLabel).

change note
type: AnnotationProperty
definition: A note about a modification to a concept.

definition
type: AnnotationProperty
definition: A statement or formal explanation of the meaning of a concept.

example
type: AnnotationProperty
definition: An example of the use of a concept.

note
type: AnnotationProperty
definition: A general note, for any purpose.
scope note: This property may be used directly, or as a super-property for more specific note types.

preferred label
type: AnnotationProperty
comment: A resource has no more than one value of skos:prefLabel per language tag, and no more than one value of skos:prefLabel without language tag.
comment: The range of skos:prefLabel is the class of RDF plain literals.
comment: skos:prefLabel, skos:altLabel and skos:hiddenLabel are pairwise disjoint properties.
definition: The preferred lexical label for a resource, in a given language.

scope note
type: AnnotationProperty
definition: A note that helps to clarify the meaning and/or the use of a concept.

GML Literal
type: Datatype
Contributor: Matthew Perry
creator: OGC GeoSPARQL 1.0 Standard Working Group
date: 2011-06-16
description: A GML serialization of a geometry object.

Well-known Text Literal
type: Datatype
Contributor: Matthew Perry
creator: OGC GeoSPARQL 1.0 Standard Working Group
date: 2011-06-16
description: A Well-known Text serialization of a geometry object.

defaultGeometry
type: ObjectProperty
sub property of: hasGeometry
domain: Feature
range: Geometry
Contributor: Matthew Perry
creator: OGC GeoSPARQL 1.0 Standard Working Group
date: 2011-06-16
description: The default geometry to be used in spatial calculations. It is Usually the most detailed geometry.

contains
type: ObjectProperty
domain: SpatialObject
range: SpatialObject
Contributor: Matthew Perry
creator: OGC GeoSPARQL 1.0 Standard Working Group
date: 2011-06-16
description: Exists if the subject SpatialObject spatially contains the object SpatialObject. DE-9IM: T*TFF*FF*

coveredBy
type: ObjectProperty
domain: SpatialObject
range: SpatialObject
Contributor: Matthew Perry
creator: OGC GeoSPARQL 1.0 Standard Working Group
date: 2011-06-16
description: Exists if the subject SpatialObject is spatially covered by the object SpatialObject. DE-9IM: TFF*TFT**

covers
type: ObjectProperty
domain: SpatialObject
range: SpatialObject
Contributor: Matthew Perry
creator: OGC GeoSPARQL 1.0 Standard Working Group
date: 2011-06-16
description: Exists if the subject SpatialObject spatially covers the object SpatialObject. DE-9IM: T*TFT*FF*

disjoint
type: ObjectProperty
domain: SpatialObject
range: SpatialObject
Contributor: Matthew Perry
creator: OGC GeoSPARQL 1.0 Standard Working Group
date: 2011-06-16
description: Exists if the subject SpatialObject is spatially disjoint from the object SpatialObject. DE-9IM: FF*FF****

equals
type: ObjectProperty
domain: SpatialObject
range: SpatialObject
Contributor: Matthew Perry
creator: OGC GeoSPARQL 1.0 Standard Working Group
date: 2011-06-16
description: Exists if the subject SpatialObject spatially equals the object SpatialObject. DE-9IM: TFFFTFFFT

inside
type: ObjectProperty
domain: SpatialObject
range: SpatialObject
Contributor: Matthew Perry
creator: OGC GeoSPARQL 1.0 Standard Working Group
date: 2011-06-16
description: Exists if the subject SpatialObject is spatially inside the object SpatialObject. DE-9IM: TFF*FFT**

meet
type: ObjectProperty
domain: SpatialObject
range: SpatialObject
Contributor: Matthew Perry
creator: OGC GeoSPARQL 1.0 Standard Working Group
date: 2011-06-16
description: Exists if the subject SpatialObject spatially meets the object SpatialObject. DE-9IM: FT******* ^ F**T***** ^ F***T****

overlap
type: ObjectProperty
domain: SpatialObject
range: SpatialObject
Contributor: Matthew Perry
creator: OGC GeoSPARQL 1.0 Standard Working Group
date: 2011-06-16
description: Exists if the subject SpatialObject spatially overlaps the object SpatialObject. DE-9IM: T*T***T**

hasGeometry
type: ObjectProperty
domain: Feature
range: Geometry
Contributor: Matthew Perry
creator: OGC GeoSPARQL 1.0 Standard Working Group
date: 2011-06-16
description: A spatial representation for a given feature.

disconnected
type: ObjectProperty
domain: SpatialObject
range: SpatialObject
Contributor: Matthew Perry
creator: OGC GeoSPARQL 1.0 Standard Working Group
date: 2011-06-16
description: Exists if the subject SpatialObject is spatially disjoint from the object SpatialObject. DE-9IM: FFTFFTTTT

externally connected
type: ObjectProperty
domain: SpatialObject
range: SpatialObject
Contributor: Matthew Perry
creator: OGC GeoSPARQL 1.0 Standard Working Group
date: 2011-06-16
description: Exists if the subject SpatialObject spatially meets the object SpatialObject. DE-9IM: FFTFTTTTT

equals
type: ObjectProperty
domain: SpatialObject
range: SpatialObject
Contributor: Matthew Perry
creator: OGC GeoSPARQL 1.0 Standard Working Group
date: 2011-06-16
description: Exists if the subject SpatialObject spatially equals the object SpatialObject. DE-9IM: TFFFTFFFT

non-tangential proper part
type: ObjectProperty
domain: SpatialObject
range: SpatialObject
Contributor: Matthew Perry
creator: OGC GeoSPARQL 1.0 Standard Working Group
date: 2011-06-16
description: Exists if the subject SpatialObject is spatially inside the object SpatialObject. DE-9IM: TFFTFFTTT

non-tangential proper part inverse
type: ObjectProperty
domain: SpatialObject
range: SpatialObject
Contributor: Matthew Perry
creator: OGC GeoSPARQL 1.0 Standard Working Group
date: 2011-06-16
description: Exists if the subject SpatialObject spatially contains the object SpatialObject. DE-9IM: TTTFFTFFT

partially overlapping
type: ObjectProperty
domain: SpatialObject
range: SpatialObject
Contributor: Matthew Perry
creator: OGC GeoSPARQL 1.0 Standard Working Group
date: 2011-06-16
description: Exists if the subject SpatialObject spatially overlaps the object SpatialObject. DE-9IM: TTTTTTTTT

tangential proper part
type: ObjectProperty
domain: SpatialObject
range: SpatialObject
Contributor: Matthew Perry
creator: OGC GeoSPARQL 1.0 Standard Working Group
date: 2011-06-16
description: Exists if the subject SpatialObject is spatially covered by the object SpatialObject. DE-9IM: TFFTTFTTT

tangential proper part inverse
type: ObjectProperty
domain: SpatialObject
range: SpatialObject
Contributor: Matthew Perry
creator: OGC GeoSPARQL 1.0 Standard Working Group
date: 2011-06-16
description: Exists if the subject SpatialObject spatially covers the object SpatialObject. DE-9IM: TTTFTTFFT

contains
type: ObjectProperty
domain: SpatialObject
range: SpatialObject
Contributor: Matthew Perry
creator: OGC GeoSPARQL 1.0 Standard Working Group
date: 2011-06-16
description: Exists if the subject SpatialObject spatially contains the object SpatialObject. DE-9IM: T*****FF*

crosses
type: ObjectProperty
domain: SpatialObject
range: SpatialObject
Contributor: Matthew Perry
creator: OGC GeoSPARQL 1.0 Standard Working Group
date: 2011-06-16
description: Exists if the subject SpatialObject spatially crosses the object SpatialObject. DE-9IM: T*T******

disjoint
type: ObjectProperty
domain: SpatialObject
range: SpatialObject
Contributor: Matthew Perry
creator: OGC GeoSPARQL 1.0 Standard Working Group
date: 2011-06-16
description: Exists if the subject SpatialObject is spatially disjoint from the object SpatialObject. DE-9IM: FF*FF****

equals
type: ObjectProperty
domain: SpatialObject
range: SpatialObject
Contributor: Matthew Perry
creator: OGC GeoSPARQL 1.0 Standard Working Group
date: 2011-06-16
description: Exists if the subject SpatialObject spatially equals the object SpatialObject. DE-9IM: TFFFTFFFT

intersects
type: ObjectProperty
domain: SpatialObject
range: SpatialObject
Contributor: Matthew Perry
creator: OGC GeoSPARQL 1.0 Standard Working Group
date: 2011-06-16
description: Exists if the subject SpatialObject is not spatially disjoint from the object SpatialObject. DE-9IM: T******** ^ *T******* ^ ***T***** ^ ****T****

overlaps
type: ObjectProperty
domain: SpatialObject
range: SpatialObject
Contributor: Matthew Perry
creator: OGC GeoSPARQL 1.0 Standard Working Group
date: 2011-06-16
description: Exists if the subject SpatialObject spatially overlaps the object SpatialObject. DE-9IM: T*T***T**

touches
type: ObjectProperty
domain: SpatialObject
range: SpatialObject
Contributor: Matthew Perry
creator: OGC GeoSPARQL 1.0 Standard Working Group
date: 2011-06-16
description: Exists if the subject SpatialObject spatially touches the object SpatialObject. DE-9IM: FT******* ^ F**T***** ^ F***T****

within
type: ObjectProperty
domain: SpatialObject
range: SpatialObject
Contributor: Matthew Perry
creator: OGC GeoSPARQL 1.0 Standard Working Group
date: 2011-06-16
description: Exists if the subject SpatialObject is spatially within the object SpatialObject. DE-9IM: T*F**F***

has broader match
type: ObjectProperty
sub property of: has broader
sub property of: is in mapping relation with
inverse of: has narrower match
definition: skos:broadMatch is used to state a hierarchical mapping link between two conceptual resources in different concept schemes.

has broader
type: ObjectProperty
sub property of: has broader transitive
inverse of: has narrower
comment: Broader concepts are typically rendered as parents in a concept hierarchy (tree).
definition: Relates a concept to a concept that is more general in meaning.
scope note: By convention, skos:broader is only used to assert an immediate (i.e. direct) hierarchical link between two conceptual resources.

has broader transitive
type: ObjectProperty
sub property of: is in semantic relation with
inverse of: has narrower transitive
type: TransitiveProperty
definition: skos:broaderTransitive is a transitive superproperty of skos:broader.
scope note: By convention, skos:broaderTransitive is not used to make assertions. Rather, the properties can be used to draw inferences about the transitive closure of the hierarchical relation, which is useful e.g. when implementing a simple query expansion algorithm in a search application.

has close match
type: ObjectProperty
sub property of: is in mapping relation with
type: SymmetricProperty
definition: skos:closeMatch is used to link two concepts that are sufficiently similar that they can be used interchangeably in some information retrieval applications. In order to avoid the possibility of "compound errors" when combining mappings across more than two concept schemes, skos:closeMatch is not declared to be a transitive property.

has exact match
type: ObjectProperty
sub property of: has close match
type: SymmetricProperty
type: TransitiveProperty
comment: skos:exactMatch is disjoint with each of the properties skos:broadMatch and skos:relatedMatch.
definition: skos:exactMatch is used to link two concepts, indicating a high degree of confidence that the concepts can be used interchangeably across a wide range of information retrieval applications. skos:exactMatch is a transitive property, and is a sub-property of skos:closeMatch.

has top concept
type: ObjectProperty
inverse of: is top concept in scheme
domain: Concept Scheme
range: Concept
definition: Relates, by convention, a concept scheme to a concept which is topmost in the broader/narrower concept hierarchies for that scheme, providing an entry point to these hierarchies.

is in scheme
type: ObjectProperty
range: Concept Scheme
definition: Relates a resource (for example a concept) to a concept scheme in which it is included.
scope note: A concept may be a member of more than one concept scheme.

is in mapping relation with
type: ObjectProperty
sub property of: is in semantic relation with
comment: These concept mapping relations mirror semantic relations, and the data model defined below is similar (with the exception of skos:exactMatch) to the data model defined for semantic relations. A distinct vocabulary is provided for concept mapping relations, to provide a convenient way to differentiate links within a concept scheme from links between concept schemes. However, this pattern of usage is not a formal requirement of the SKOS data model, and relies on informal definitions of best practice.
definition: Relates two concepts coming, by convention, from different schemes, and that have comparable meanings

has member
type: ObjectProperty
domain: Collection
range: Class
  union of: Collection
  union of: Concept
definition: Relates a collection to one of its members.

has member list
type: ObjectProperty
type: FunctionalProperty
domain: Ordered Collection
range: List
comment: For any resource, every item in the list given as the value of the skos:memberList property is also a value of the skos:member property.
definition: Relates an ordered collection to the RDF list containing its members.

has narrower match
type: ObjectProperty
sub property of: is in mapping relation with
sub property of: has narrower
definition: skos:narrowMatch is used to state a hierarchical mapping link between two conceptual resources in different concept schemes.

has narrower
type: ObjectProperty
sub property of: has narrower transitive
comment: Narrower concepts are typically rendered as children in a concept hierarchy (tree).
definition: Relates a concept to a concept that is more specific in meaning.
scope note: By convention, skos:broader is only used to assert an immediate (i.e. direct) hierarchical link between two conceptual resources.

has narrower transitive
type: ObjectProperty
sub property of: is in semantic relation with
type: TransitiveProperty
definition: skos:narrowerTransitive is a transitive superproperty of skos:narrower.
scope note: By convention, skos:narrowerTransitive is not used to make assertions. Rather, the properties can be used to draw inferences about the transitive closure of the hierarchical relation, which is useful e.g. when implementing a simple query expansion algorithm in a search application.

has related
type: ObjectProperty
sub property of: is in semantic relation with
type: SymmetricProperty
comment: skos:related is disjoint with skos:broaderTransitive
definition: Relates a concept to a concept with which there is an associative semantic relationship.

has related match
type: ObjectProperty
sub property of: is in mapping relation with
sub property of: has related
type: SymmetricProperty
definition: skos:relatedMatch is used to state an associative mapping link between two conceptual resources in different concept schemes.

is in semantic relation with
type: ObjectProperty
domain: Concept
range: Concept
definition: Links a concept to a concept related by meaning.
scope note: This property should not be used directly, but as a super-property for all properties denoting a relationship of meaning between concepts.

is top concept in scheme
type: ObjectProperty
sub property of: is in scheme
domain: Concept
range: Concept Scheme
definition: Relates a concept to the concept scheme that it is a top level concept of.

acts on property
type: ObjectProperty
inverse of: is acted on by
domain includes: Actuation
range includes: Actuatable Property
comment: Relation between an Actuation and the property of a FeatureOfInterest it is acting upon.
example: In the activity (Actuation) of automatically closing a window if the temperature in a room drops below 20 degrees Celsius, the property on which the Actuator acts upon is the state of the window as it changes from being open to being closed.

has feature of interest
type: ObjectProperty
inverse of: is feature of interest of
domain includes: Actuation
domain includes: Observation
domain includes: Sampling
range includes: Feature Of Interest
range includes: Sample
comment: A relation between an Observation and the entity whose quality was observed, or between an Actuation and the entity whose property was modified, or between an act of Sampling and the entity that was sampled.
example: For example, in an Observation of the weight of a person, the FeatureOfInterest is the person and the property is its weight.

has result
type: ObjectProperty
inverse of: is result of
domain includes: Actuation
domain includes: Observation
domain includes: Sampling
range includes: Result
range includes: Sample
comment: Relation linking an Observation or Actuation or act of Sampling and a Result or Sample.

has sample
type: ObjectProperty
inverse of: is sample of
domain includes: Feature Of Interest
range includes: Sample
comment: Relation between a FeatureOfInterest and the Sample used to represent it.

hosts
type: ObjectProperty
inverse of: is hosted by
domain includes: Platform
range includes: Actuator
range includes: Platform
range includes: Sampler
range includes: Sensor
comment: Relation between a Platform and a Sensor, Actuator, Sampler, or Platform, hosted or mounted on it.

is acted on by
type: ObjectProperty
domain includes: Actuatable Property
range includes: Actuation
comment: Relation between an ActuatableProperty of a FeatureOfInterest and an Actuation changing its state.
example: In the activity (Actuation) of automatically closing a window if the temperature in a room drops below 20 degrees Celsius, the property on which the Actuator acts upon is the state of the window as it changes from being open to being closed.

is feature of interest of
type: ObjectProperty
domain includes: Feature Of Interest
domain includes: Sample
range includes: Actuation
range includes: Observation
range includes: Sampling
comment: A relation between a FeatureOfInterest and an Observation about it, an Actuation acting on it, or an act of Sampling that sampled it.

is hosted by
type: ObjectProperty
domain includes: Actuator
domain includes: Platform
domain includes: Sampler
domain includes: Sensor
range includes: Platform
comment: Relation between a Sensor, Actuator, Sampler, or Platform, and the Platform that it is mounted on or hosted by.

is observed by
type: ObjectProperty
inverse of: observes
domain includes: Observable Property
range includes: Sensor
comment: Relation between an ObservableProperty and the Sensor able to observe it.

is result of
type: ObjectProperty
domain includes: Result
domain includes: Sample
range includes: Actuation
range includes: Observation
range includes: Sampling
comment: Relation linking a Result to the Observation or Actuation or act of Sampling that created or caused it.

is sample of
type: ObjectProperty
domain includes: Sample
range includes: Feature Of Interest
comment: Relation from a Sample to the FeatureOfInterest that it is intended to be representative of.

made actuation
type: ObjectProperty
inverse of: made by actuator
domain includes: Actuator
range includes: Actuation
comment: Relation between an Actuator and the Actuation it has made.

made by actuator
type: ObjectProperty
domain includes: Actuation
range includes: Actuator
comment: Relation linking an Actuation to the Actuator that made that Actuation.

made by sampler
type: ObjectProperty
inverse of: made sampling
domain includes: Sampling
range includes: Sampler
comment: Relation linking an act of Sampling to the Sampler (sampling device or entity) that made it.

made by sensor
type: ObjectProperty
inverse of: made observation
domain includes: Observation
range includes: Sensor
comment: Relation between an Observation and the Sensor which made the Observation.

made observation
type: ObjectProperty
domain includes: Sensor
range includes: Observation
comment: Relation between a Sensor and an Observation made by the Sensor.

made sampling
type: ObjectProperty
domain includes: Sampler
range includes: Sampling
comment: Relation between a Sampler (sampling device or entity) and the Sampling act it performed.

observed property
type: ObjectProperty
domain includes: Observation
range includes: Observable Property
comment: Relation linking an Observation to the property that was observed. The ObservableProperty should be a property of the FeatureOfInterest (linked by hasFeatureOfInterest) of this Observation.

observes
type: ObjectProperty
domain includes: Sensor
range includes: Observable Property
comment: Relation between a Sensor and an ObservableProperty that it is capable of sensing.

controlArea
type: ObjectProperty
range: Control Area
comment: Control Area indicates if it is 1x1 km or 10x10 km in VAS.

Coordinates location
type: ObjectProperty
sub property of: location
sub property of: Located in
domain: Class
  union of: Platform
  union of: Control Area
range: SpatialThing
comment: Indica las coordinadas en las que está localizado la estación. @es
comment: Indicates the coordinates in which the station is located.

hasObservation
type: ObjectProperty
inverse of: isObservationOf
domain: Snapshot
range: Satellite Observation
comment: A Snapshot has a satellite observation

has product
type: ObjectProperty
domain: Snapshot
range: Satellite Product
comment: Someting (usually a snapshot) has product.

hasSatelliteSource
type: ObjectProperty
sub property of: topObjectProperty
inverse of: isSatelliteSourceOf
domain: Satellite Product
range: Satellite
comment: The satellite products have satellite sources

hasTypeOfCover
type: ObjectProperty
range: Land Cover Classes
comment: The property indicates the type of cover classes.

Located in
type: ObjectProperty
domain: Class
  union of: Platform
  union of: Control Area
range: Class
  union of: AdministrativeUnit
  union of: SpatialThing
comment: Indica la localización de las estaciones @es
comment: Indicates the location of the stations.

Located in municipality
type: ObjectProperty
sub property of: location
sub property of: Located in
domain: Class
  union of: Platform
  union of: Control Area
range: Municipality
comment: Indica el municipio en el que está localizado un sensor. @es
comment: Indicates the municipality in which a sensor is located.

Located in province
type: ObjectProperty
sub property of: location
sub property of: Located in
domain: Class
  union of: Platform
  union of: Control Area
range: Province
comment: Indicates the province in which a sensor is located.

Bare soil percentage
type: DatatypeProperty
sub property of: sentinel2ProductProperties
type: FunctionalProperty
domain: Sentinel-2_Product
range: decimal
comment: Bare soil percentage Example: 35.747452

Cloud cover
type: DatatypeProperty
sub property of: landsat8ProductProperties
domain: Landsat-8_Product
range: decimal
comment: Cloud coverage (percent) of a WRS scene. Values: 0.00 - 100.00 -1 = Cloud cover not calculated or assessed

Cloud cover land
type: DatatypeProperty
sub property of: landsat8ProductProperties
domain: Landsat-8_Product
range: decimal
comment: All sensors = Cloud coverage over land (percent) assigned to a WRS scene. Values: -1 = Cloud cover land not calculated or assessed.

Collection category
type: DatatypeProperty
sub property of: landsat8ProductProperties
domain: Landsat-8_Product
range: string
comment: Landsat Collection 1 is organized by a tiered inventory structure to indicate the quality and level of processing of the data. Values: T1 = Tier 1 is the highest available quality and processing level. This category is suitable for time-series analysis across the different Landsat sensors. T2 = Tier 2 scenes contain significant cloud cover and have insufficient ground control to generate precision and terrain corrected products. RT = Real-Time indicates initial processing with additional processing required to achieve Tier 1 or Tier 2.

Date acquired
type: DatatypeProperty
sub property of: landsat8ProductProperties
domain: Landsat-8_Product
range: dateTime
comment: Year, month and day that this scene was imaged. Format: YYYY/MM/DD

Datum
type: DatatypeProperty
sub property of: landsat8ProductProperties
domain: Landsat-8_Product
range: string
comment: Datum used in creating the image. Values: WGS84 = World Geodetic System 1984

Filename
type: DatatypeProperty
sub property of: CommonProperties
type: FunctionalProperty
domain: SMOS_Product
domain: Sentinel-2_Product
domain: Sentinel-3_Product
range: string
comment: Package file name, with extension ‘.SAFE’. Example: S2B_MSIL2A_20180628T105619_N0208_R094_T30SUF_20180628T151421.SAFE

Footprint
type: DatatypeProperty
sub property of: CommonProperties
type: FunctionalProperty
domain: Landsat-8_Product
domain: Sentinel-2_Product
domain: Sentinel-3_Product
range: Well-known Text Literal
comment: Boundaries of the frame in a simplified form.The coordinates shall be declared in a counter-clockwise order. Example: POLYGON ((-5.248379903953922 37.02527578563511,-4.014302538465313 37.042247242200354,-4.001451962964202 36.05254100905861,-5.219917191699283 36.03616769808406,-5.248379903953922 37.02527578563511))

High proba clouds percentage
type: DatatypeProperty
sub property of: sentinel2ProductProperties
type: FunctionalProperty
domain: Sentinel-2_Product
range: decimal
comment: High proba clouds percentage Example: 0.232073

Identifier
type: DatatypeProperty
sub property of: sentinel2ProductProperties
type: FunctionalProperty
domain: Sentinel-2_Product
range: string
comment: Identifier Example: S2A_MSIL1C_20180603T110041_N0206_R094_T30SUF_20180603T130559

Image quality OLI
type: DatatypeProperty
sub property of: landsat8ProductProperties
domain: Landsat-8_Product
range: decimal
comment: Composite image quality for the bands. For Landsat 8 or 9, if scene is OLI or OLI_TIRS combined, value will reflect OLI quality score. If TIRS, the TIRS quality score will be used Values: 9 = Best 0 = Worst -1 = Image quality not calculated or assessed

Image quality TIRS
type: DatatypeProperty
sub property of: landsat8ProductProperties
domain: Landsat-8_Product
range: decimal
comment: Composite image quality for the bands. For Landsat 8 or 9, if scene is OLI or OLI_TIRS combined, value will reflect OLI quality score. If TIRS, the TIRS quality score will be used Values: 9 = Best 0 = Worst -1 = Image quality not calculated or assessed

Instrument name
type: DatatypeProperty
sub property of: sentinel2ProductProperties
type: FunctionalProperty
domain: Sentinel-2_Product
range: string
comment: The instrument name used for acquiring the data. Example: Multi-Spectral Instrument

Landsat product ID
type: DatatypeProperty
sub property of: landsat8ProductProperties
domain: Landsat-8_Product
range: string
comment: The naming convention of each L7 ETM+ Collection 1 Level-1 image is based on acquisition and processing parameters. Format: LXSS_LLLL_PPPRRR_YYYYMMDD_yyyymmdd_CC_TX L = Landsat X = Sensor (E = Enhanced Thematic Mapper Plus) SS = Satellite (07 = Landsat 7) LLLL = Processing Correction Level (L1TP = precision and terrain, L1GT = systematic terrain, L1GS = systematic) PPP = WRS Path RRR = WRS Row YYYYMMDD = Acquisition Date expressed in Year, Month, Day yyyymmdd = Processing Date expressed in Year, Month, Day CC = Collection Number (01) TX = Collection Category (RT = Real Time, T1 = Tier 1, T2 = Tier 2) Example: LE07_L1TP_029030_20140715_20140805_02_T1

Product download link
type: DatatypeProperty
sub property of: sentinel2ProductProperties
type: FunctionalProperty
domain: Sentinel-2_Product
range: anyURI
comment: Download link for the product from https://scihub.copernicus.eu Example: https://scihub.copernicus.eu/dhus/odata/v1/Products('95bec4b4-a2d4-4b6f-a7cd-1de5cb3e85b7')/$value

Link to product
type: DatatypeProperty
sub property of: sentinel2ProductProperties
type: FunctionalProperty
domain: Sentinel-2_Product
range: anyURI
comment: Link to the product from https://scihub.copernicus.eu Example: https://scihub.copernicus.eu/dhus/odata/v1/Products('95bec4b4-a2d4-4b6f-a7cd-1de5cb3e85b7')/

Map projection
type: DatatypeProperty
sub property of: landsat8ProductProperties
domain: Landsat-8_Product
range: string
comment: L0Ra map projection selectively applied to HDTs based on geographic location. Used for processed archive data. Values: HOM = Hotine Oblique Mercator UTM = Universal Transverse Mercator

Orbit direction
type: DatatypeProperty
sub property of: sentinel2ProductProperties
type: FunctionalProperty
domain: Sentinel-2_Product
range: string
comment: Orbit direccion while taking he product Can be either 'ASCENDING' or 'DESCENDING' Example: 'ASCENDING'

Orientation
type: DatatypeProperty
sub property of: landsat8ProductProperties
domain: Landsat-8_Product
range: string
comment: Orientation used in creating the image. Values: NOMINAL = Nominal Path NORTH_UP = North Up TRUE_NORTH = True North USER = User

Origin
type: DatatypeProperty
sub property of: landsat8ProductProperties
domain: Landsat-8_Product
range: string
comment: Origin of the image Values: Example: "Image courtesy of the U.S. Geological Survey"

Platform name
type: DatatypeProperty
sub property of: sentinel2ProductProperties
type: FunctionalProperty
domain: Sentinel-2_Product
range: string
comment: The mission full name of the platform. This name is not a perfect identifier. Example:Sentinel-2

Platform serial identifier
type: DatatypeProperty
sub property of: sentinel2ProductProperties
type: FunctionalProperty
domain: Sentinel-2_Product
range: string
comment: The platform serial identifier is the sequence number of the platform among the mission Example: Sentinel-2A

Processing level
type: DatatypeProperty
sub property of: sentinel2ProductProperties
type: FunctionalProperty
domain: Sentinel-2_Product
range: string
comment: The level of the last processing Example: Level-2A

Size
type: DatatypeProperty
sub property of: sentinel2ProductProperties
type: FunctionalProperty
domain: Sentinel-2_Product
range: string
comment: Size of the product Example: 634.50 MB

Snow ice percentage
type: DatatypeProperty
sub property of: sentinel2ProductProperties
type: FunctionalProperty
domain: Sentinel-2_Product
range: decimal
comment: Percentage of snow ice Example: 0.00018899999999999999

Title
type: DatatypeProperty
sub property of: sentinel2ProductProperties
type: FunctionalProperty
domain: Sentinel-2_Product
range: string
comment: Title Example: S2A_MSIL2A_20170628T105651_N0205_R094_T30SUF_20170628T110445

UTM zone
type: DatatypeProperty
sub property of: landsat8ProductProperties
domain: Landsat-8_Product
range: string
comment: UTM (Universal Transverse Mercator) zone number in a map projection. A negative zone indicates that the false northing needs to be applied to the northing coordinate and a positive zone indicates that the false northing has been applied. Values: Negative Zone = Indicates that the false northing needs to be applied. Positive Zone = Indicates that the false northing has been applied.

Vegetation percentage
type: DatatypeProperty
sub property of: sentinel2ProductProperties
type: FunctionalProperty
domain: Sentinel-2_Product
range: decimal
comment: Percentage of vegetation Example: 10.589334000000001

Water percentage
type: DatatypeProperty
sub property of: sentinel2ProductProperties
type: FunctionalProperty
domain: Sentinel-2_Product
range: decimal
comment: Water of percentage Example: 15.87375

numeric value
type: DatatypeProperty

code INE
type: DatatypeProperty
range: Literal
comment: Coding assigned by the INE Nomenclature

coordinateDimension
type: DatatypeProperty
domain: Geometry
range: integer
Contributor: Matthew Perry
creator: OGC GeoSPARQL 1.0 Standard Working Group
date: 2011-06-16
description: The number of measurements or axes needed to describe the position of this geometry in a coordinate system.

dimension
type: DatatypeProperty
domain: Geometry
range: integer
Contributor: Matthew Perry
creator: OGC GeoSPARQL 1.0 Standard Working Group
date: 2011-06-16
description: The topological dimension of this geometric object, which must be less than or equal to the coordinate dimension. In non-homogeneous collections, this will return the largest topological dimension of the contained objects.

isEmpty
type: DatatypeProperty
domain: Geometry
range: boolean
Contributor: Matthew Perry
creator: OGC GeoSPARQL 1.0 Standard Working Group
date: 2011-06-16
description: (true) if this geometric object is the empty Geometry. If true, then this geometric object represents the empty point set for the coordinate space.

isSimple
type: DatatypeProperty
domain: Geometry
range: boolean
Contributor: Matthew Perry
creator: OGC GeoSPARQL 1.0 Standard Working Group
date: 2011-06-16
description: (true) if this geometric object has no anomalous geometric points, such as self intersection or self tangency.

spatialDimension
type: DatatypeProperty
domain: Geometry
range: integer
Contributor: Matthew Perry
creator: OGC GeoSPARQL 1.0 Standard Working Group
date: 2011-06-16
description: The number of measurements or axes needed to describe the spatial position of this geometry in a coordinate system.

altitude
type: DatatypeProperty
sub property of: geo WGS84
comment: Altitude in WGS84

latitude
type: DatatypeProperty
sub property of: geo WGS84
range: float
comment: Latitude in WGS84

longitude
type: DatatypeProperty
sub property of: geo WGS84
range: float
comment: Longitude in WGS84

result time
type: DatatypeProperty
range: dateTime
domain includes: Satellite Product
domain includes: Actuation
domain includes: Observation
domain includes: Sampling
comment: The result time is the instant of time when the Observation, Actuation or Sampling activity was completed.

canonical units
type: DatatypeProperty
comment: canonical units

URL10x10
type: DatatypeProperty
range: anyURI
comment: URL for 10x10 area

URL1x1
type: DatatypeProperty
range: anyURI
comment: URL for 1x1 area

Abbreviation
type: DatatypeProperty
sub property of: Filename

Adquisition Period
type: DatatypeProperty
sub property of: sentinel3ProductProperties

Cloudy pixels
type: DatatypeProperty
sub property of: sentinel3ProductProperties
range: decimal

code CLC
type: DatatypeProperty
domain: Land Cover Classes
range: integer
comment: Corine Land Cover (CLC) code.

CommonProperties
type: DatatypeProperty

File Description
type: DatatypeProperty
sub property of: smosProductsProperties
domain: SMOS_Product

Grid Mapping
type: DatatypeProperty
sub property of: smapProductProperties
domain: SMAP_Product
range: string

Ground Track Direction
type: DatatypeProperty
sub property of: sentinel3ProductProperties
range: string

Land pixels
type: DatatypeProperty
sub property of: sentinel3ProductProperties
range: decimal

landsat8ProductProperties
type: DatatypeProperty
domain: Landsat-8_Product
comment: Landsat 8 product properties

Longname
type: DatatypeProperty
sub property of: CommonProperties
domain: MODIS-Aqua_Product
domain: MODIS-Terra_Product
domain: SMAP_Product
range: string

Missing Value
type: DatatypeProperty
sub property of: smapProductProperties
domain: SMAP_Product
range: float

Mission
type: DatatypeProperty
sub property of: smosProductsProperties
domain: SMOS_Product

modisProductProperties
type: DatatypeProperty
domain: MODIS-Aqua_Product
domain: MODIS-Terra_Product
comment: MODIS Aqua / Terra product properties

number
type: DatatypeProperty
sub property of: sentinel3ProductProperties

Post List
type: DatatypeProperty
sub property of: Footprint

Product name
type: DatatypeProperty
sub property of: sentinel3ProductProperties
range: string

Product type
type: DatatypeProperty
sub property of: sentinel3ProductProperties
range: string

Relative Orbit Number
type: DatatypeProperty
sub property of: sentinel3ProductProperties
range: integer

Scale Factor
type: DatatypeProperty
sub property of: modisProductProperties
domain: MODIS-Aqua_Product
domain: MODIS-Terra_Product

sentinel2ProductProperties
type: DatatypeProperty
domain: Sentinel-2_Product
comment: Sentinel-2 product properties

sentinel3ProductProperties
type: DatatypeProperty
domain: Sentinel-3_Product
comment: Sentinel-3 product properties

smapProductProperties
type: DatatypeProperty
domain: SMAP_Product
comment: SMAP product properties

smosProductsProperties
type: DatatypeProperty
domain: SMOS_Product
comment: SMOS product properties

SRS Name
type: DatatypeProperty
sub property of: Footprint

Start time
type: DatatypeProperty
sub property of: Adquisition Period
range: dateTime

Stop time
type: DatatypeProperty
sub property of: Adquisition Period
range: dateTime

Timeliness
type: DatatypeProperty
sub property of: sentinel3ProductProperties
range: string

Unit
type: DatatypeProperty
sub property of: CommonProperties
domain: MODIS-Aqua_Product
domain: MODIS-Terra_Product
domain: SMAP_Product
range: string

Valid Max
type: DatatypeProperty
sub property of: smapProductProperties
domain: SMAP_Product
range: float

Valid Min
type: DatatypeProperty
sub property of: smapProductProperties
domain: SMAP_Product
range: float

Anemometer_AEMET
type: Class
subclass of: Anemometer
subclass of: Restriction
  all values from: AEMET_Station
  on property: is hosted by
comment: Measures the intensity (m/s) of the wind

Barometer_AEMET
type: Class
subclass of: Barometer
subclass of: Restriction
  all values from: AEMET_Station
  on property: is hosted by
comment: Measures pressure in hPa. AEMET Station.

Clock_AEMET
type: Class
subclass of: Ground Based Sensing
subclass of: Restriction
  all values from: AEMET_Station
  on property: is hosted by
subclass of: Restriction
  has value: time
  on property: observes
comment: Mide el tiempo en UTC
label: Reloj @es

Heliograph_AEMET
type: Class
subclass of: Ground Based Sensing
subclass of: Restriction
  all values from: AEMET_Station
  on property: is hosted by
subclass of: Restriction
  has value: duration of sunshine
  on property: observes
comment: Sensor belongs to AEMET Station.Measures the duration of sunshine in hours

Hygrometer_AEMET
type: Class
subclass of: Hygrometer
subclass of: Restriction
  all values from: AEMET_Station
  on property: is hosted by
comment: Sensor belongs to AEMET Station. Measures relative humidity in %

Pluviometer
type: Class
subclass of: Ground Based Sensing
subclass of: Restriction
  all values from: AEMET_Station
  on property: is hosted by
subclass of: Restriction
  has value: precipitation amount
  on property: observes
label: Pluviometer_AEMET
label: Sensor belongs to AEMET Station. Measures precipitation in mm = l/m^2

Thermometer_AEMET
type: Class
subclass of: Thermometer
subclass of: Restriction
  all values from: AEMET_Station
  on property: is hosted by
subclass of: Restriction
  has value: temperature in ground depth 05
  on property: observes
subclass of: Restriction
  has value: temperature in ground depth 20
  on property: observes
subclass of: Restriction
  has value: temperature in ground next ground
  on property: observes
comment: Sensor belongs to AEMET Station. Measures temperature in degrees Celsius both on Ground or in Air.

AEMET_Station
type: Class
subclass of: Ground Station
subclass of: Restriction
  all values from: Class
    union of: Anemometer_AEMET
    union of: Barometer_AEMET
    union of: Clock_AEMET
    union of: Heliograph_AEMET
    union of: Hygrometer_AEMET
    union of: Pluviometer
    union of: Thermometer_AEMET
    union of: WindVane_AEMET
  on property: hosts
comment: A weather station is a facility intended to regularly measure and record various meteorological variables.
label: Weather station

Town
type: Class
subclass of: AdministrativeUnit
comment: DGT Rules for TPEG Location townname: first see if the literal is in town, if not, search in municipality other: first see if the literal is in towns, if not, search in province
comment: Reglas DGT para TPEG Localizacion: townname:primero ver si el literal está en población, si no, buscar en municipio other: primero ver si el literal está en población, si no, buscar en provincia @es

Meteorology Property
type: Class
subclass of: Observable Property
comment: Class that represents all Meteorological properties

Soil Property
type: Class
subclass of: Observable Property
comment: Class that represents all Soil properties

WindVane
type: Class
subclass of: Ground Based Sensing
subclass of: Restriction
  has value: wind from direction
  on property: observes
comment: Sensor that takes wind direction measurements

Dimensionless Unit
type: Class
subclass of: Unit
comment: A Dimensionless Unit is a quantity for which all the exponents of the factors corresponding to the base quantities in its quantity dimension are zero.

Quantifiable
type: Class
comment: Quantifiable ascribes to some thing the capability of being measured, observed, or counted.
is defined by: <http://qudt.org/2.1/schema/shacl/qudt> <http://qudt.org/2.1/schema/qudt>

Quantity value
type: Class
subclass of: Concept
subclass of: Quantifiable
subclass of: Restriction
  cardinality: 1
  on property: unit
comment: A Quantity Value expresses the magnitude and kind of a quantity and is given by the product of a numerical value n and a unit of measure U. The number multiplying the unit is referred to as the numerical value of the quantity expressed in that unit. Refer to NIST SP 811 section 7 for more on quantity values.

AdministrativeUnit
type: Class
subclass of: Restriction
  all values from: string
  on property: title
subclass of: Restriction
  all values from: string
  on property: code INE
Source: Catálogo de Objetos Geográficos BTN100 where the official encoding associated is represented by the codigoINE property and its geometry is represented by the geosparql: hasGeometry property.
comment: The European Union understands administrative units as those areas where the Member States have or exercise their jurisdictional rights for the purposes of local, regional and national administration. They are separated by administrative boundaries and are frequently organized hierarchically, reflecting the different degrees of responsibility involved ”[INSPIRE ANNEX 1. Topic 4]. They define the areas of each municipality or condominium, province, autonomous community and Spanish nation.
comment: “La Unión Europea entiende como unidades administrativas aquellas áreas donde los Estados miembros tienen o ejercen sus derechos jurisdiccionales a efectos de administración local, regional y nacional. Están separadas mediante límites administrativos y frecuentemente están organizadas jerárquicamente, reflejando los distintos grados de responsabilidad implicados” [INSPIRE ANEXO 1.Tema 4]. Definen las áreas de cada municipio o condominio, provincia, comunidad autónoma y nación española. @es

Autonomy
type: Class
subclass of: AdministrativeUnit
comment: Autonomy (Autonomous Community or Autonomous City) to which a geographical phenomenon or an administrative entity belongs
comment: Autonomía (Comunidad Autónoma o Ciudad Autónoma) a la que pertenece un fenómeno geográfico o una entidad administrativa @es
comment: Uniprovincial or multiprovincial entity with specific territorial limits within the kingdom of Spain, which is endowed with legislative autonomy and executive powers in everything that is not common with the rest of the State.

Autonomous City
type: Class
subclass of: Autonomy
comment: Autonomous City to which a geographical phenomenon or an administrative entity belongs

Autonomous Community
type: Class
subclass of: Autonomy
comment: Autonomous Community to which a geographical phenomenon or an administrative entity belongs

Jurisdictional Community
type: Class
subclass of: AdministrativeUnit
comment: Jurisdictional Community

Municipality
type: Class
subclass of: AdministrativeUnit
comment: A municipality is an administrative entity that can group a single locality or several, it can refer to a city or a town.
comment: Un municipio es una entidad administrativa que puede agrupar una sola localidad o varias, puede hacer referencia a una ciudad o un pueblo. @es

Country
type: Class
subclass of: AdministrativeUnit
comment: A country is a territory with its own geographical and cultural characteristics, which may or may not constitute a sovereign State or a political entity within a State. It is also used as a synonym for State, a set of political institutions endowed with territory, population and sovereignty.
comment: Un país es un territorio con características geográficas y culturales propias, que puede o no constituir un Estado soberano o una entidad política dentro de un Estado. También es utilizado como sinónimo de Estado, conjunto de instituciones políticas dotadas de territorio, población y soberanía. @es

Province
type: Class
subclass of: AdministrativeUnit
comment: A province is a subnational entity of the State
comment: In Spain, < regionName > in Tpeg Location or < administrativeArea > in Location ReferencePoint
comment: Una provincia es una entidad subnacional del Estado @es

Feature
type: Class
subclass of: SpatialObject
disjoint with: Geometry
Contributor: Matthew Perry
creator: OGC GeoSPARQL 1.0 Standard Working Group
date: 2011-06-16
description: This class represents the top-level feature type. This class is equivalent to GFI_Feature defined in ISO 19156:2011, and it is superclass of all feature types.

Geometry
type: Class
subclass of: SpatialObject
Contributor: Matthew Perry
creator: OGC GeoSPARQL 1.0 Standard Working Group
date: 2011-06-16
description: The class represents the top-level geometry type. This class is equivalent to the UML class GM_Object defined in ISO 19107, and it is superclass of all geometry types.

SpatialObject
type: Class
Contributor: Matthew Perry
creator: OGC GeoSPARQL 1.0 Standard Working Group
date: 2011-06-16
description: The class spatial-object represents everything that can have a spatial representation. It is superclass of feature and geometry.

Abstract Curve Segment
type: Class
subclass of: Geometry

Abstract Geometric Primitive
type: Class
subclass of: Abstract Geometry

Abstract Geometry
type: Class
subclass of: Geometry

Abstract Gridded Surface
type: Class
subclass of: Abstract Parametric Curve Surface

Abstract Parametric Curve Surface
type: Class
subclass of: Abstract Surface Patch

Abstract Surface Patch
type: Class
subclass of: Geometry

Arc
type: Class
subclass of: Arc String

Arc by Bulge
type: Class
subclass of: Arc String by Bulge

Arc by Center Point
type: Class
subclass of: Abstract Curve Segment

Arc String
type: Class
subclass of: Abstract Curve Segment

Arc String by Bulge
type: Class
subclass of: Abstract Curve Segment

BSpline
type: Class
subclass of: Spline Curve

Bezier
type: Class
subclass of: BSpline

Circle
type: Class
subclass of: Arc

CircleByCenterPoint
type: Class
subclass of: Arc by Center Point

Clothoid
type: Class
subclass of: Abstract Curve Segment

Composite
type: Class
subclass of: Geometric Complex

Composite Curve
type: Class
subclass of: Composite
subclass of: Orientable Curve

Composite Solid
type: Class
subclass of: Composite
subclass of: Solid

Composite Surface
type: Class
subclass of: Composite
subclass of: Orientable Surface

Cone
type: Class
subclass of: Abstract Gridded Surface

Cubic Spline
type: Class
subclass of: Polynomial Spline

Curve
type: Class
subclass of: Abstract Geometric Primitive
subclass of: Orientable Curve

Cylinder
type: Class
subclass of: Abstract Gridded Surface

Geodesic
type: Class
subclass of: Geodesic String

Geodesic String
type: Class
subclass of: Abstract Curve Segment

Geometric Complex
type: Class
subclass of: Abstract Geometry

Line String
type: Class
subclass of: Line String Segment

Line String Segment
type: Class
subclass of: Abstract Curve Segment

Linear Ring
type: Class
subclass of: Ring

Multi-Curve
type: Class
subclass of: Multi-Geometry

Multi-Geometry
type: Class
subclass of: Abstract Geometry

Multi-Point
type: Class
subclass of: Multi-Geometry

Multi-Solid
type: Class
subclass of: Multi-Geometry

Multi-Surface
type: Class
subclass of: Multi-Geometry

Offset Curve
type: Class
subclass of: Abstract Curve Segment

Orientable Curve
type: Class
subclass of: Abstract Geometric Primitive

Orientable Surface
type: Class
subclass of: Abstract Geometric Primitive

Point
type: Class
subclass of: Abstract Geometric Primitive

Polygon
type: Class
subclass of: Surface

Polygon Patch
type: Class
subclass of: Abstract Surface Patch

Polyhedral Surface
type: Class
subclass of: Surface

Polynomial Spline
type: Class
subclass of: Spline Curve

Rectangle
type: Class
subclass of: Polygon Patch

Ring
type: Class
subclass of: Composite Curve

Shell
type: Class
subclass of: Composite Surface

Solid
type: Class
subclass of: Abstract Geometric Primitive

Sphere
type: Class
subclass of: Abstract Gridded Surface

Spline Curve
type: Class
subclass of: Abstract Curve Segment

Surface
type: Class
subclass of: Abstract Geometric Primitive
subclass of: Orientable Surface

Triangulated Irregular Network
type: Class
subclass of: Triangulated Surface

Triangle
type: Class
subclass of: Polygon Patch

Triangulated Surface
type: Class
subclass of: Polyhedral Surface

point
type: Class
subclass of: SpatialThing
comment: Uniquely identified by lat/long/alt. i.e. spaciallyIntersects(P1, P2) :- lat(P1, LAT), long(P1, LONG), alt(P1, ALT), lat(P2, LAT), long(P2, LONG), alt(P2, ALT). sameThing(P1, P2) :- type(P1, Point), type(P2, Point), spaciallyIntersects(P1, P2).
comment: A point, typically described using a coordinate system relative to Earth, such as WGS84.
label: Point

SpatialThing
type: Class
subclass of: Geo WGS84
comment: Spatial thing
comment: Anything with spatial extent, i.e. size, shape, or position. e.g. people, places, bowling balls, as well as abstract areas like cubes.
label: Spatial thing

Collection
type: Class
disjoint with: Concept
disjoint with: Concept Scheme
definition: A meaningful collection of concepts.
scope note: Labelled collections can be used where you would like a set of concepts to be displayed under a 'node label' in the hierarchy.

Concept
type: Class
disjoint with: Concept Scheme
definition: An idea or notion; a unit of thought.

Concept Scheme
type: Class
definition: A set of concepts, optionally including statements about semantic relationships between those concepts.
example: Thesauri, classification schemes, subject heading lists, taxonomies, 'folksonomies', and other types of controlled vocabulary are all examples of concept schemes. Concept schemes are also embedded in glossaries and terminologies.
scope note: A concept scheme may be defined to include concepts from different sources.

Ordered Collection
type: Class
subclass of: Collection
definition: An ordered collection of concepts, where both the grouping and the ordering are meaningful.
scope note: Ordered collections can be used where you would like a set of concepts to be displayed in a specific order, and optionally under a 'node label'.

Feature Of Interest
type: Class
equivalent class: Class
  one of: Air
  one of: Atmosphere of Earth
  one of: Land surface
  one of: Radiation
  one of: Soil
  one of: Vegetation
comment: The thing whose property is being estimated or calculated in the course of an Observation to arrive at a Result or whose property is being manipulated by an Actuator, or which is being sampled or transformed in an act of Sampling.
example: When measuring the height of a tree, the height is the observed ObservableProperty, 20m may be the Result of the Observation, and the tree is the FeatureOfInterest. A window is a FeatureOfInterest for an automatic window control Actuator.

Observable Property
type: Class
comment: An observable quality (property, characteristic) of a FeatureOfInterest.
example: The height of a tree, the depth of a water body, or the temperature of a surface are examples of observable properties, while the value of a classic car is not (directly) observable but asserted.

Observation
type: Class
comment: Act of carrying out an (Observation) Procedure to estimate or calculate a value of a property of a FeatureOfInterest. Links to a Sensor to describe what made the Observation and how; links to an ObservableProperty to describe what the result is an estimate of, and to a FeatureOfInterest to detail what that property was associated with.
example: The activity of estimating the intensity of an Earthquake using the Mercalli intensity scale is an Observation as is measuring the moment magnitude, i.e., the energy released by said earthquake.

Platform
type: Class
subclass of: Feature
comment: A Platform is an entity that hosts other entities, particularly Sensors, Actuators, Samplers, and other Platforms.
example: A post, buoy, vehicle, ship, aircraft, satellite, cell-phone, human or animal may act as platforms for (technical or biological) sensors or actuators.

Result
type: Class
subclass of: Quantity value
comment: The Result of an Observation, Actuation, or act of Sampling. To store an observation's simple result value one can use the hasSimpleResult property.
example: The value 20 as the height of a certain tree together with the unit, e.g., Meter.

Sensor
type: Class
comment: Device, agent (including humans), or software (simulation) involved in, or implementing, a Procedure. Sensors respond to a stimulus, e.g., a change in the environment, or input data composed from the results of prior Observations, and generate a Result. Sensors can be hosted by Platforms.
example: Accelerometers, gyroscopes, barometers, magnetometers, and so forth are Sensors that are typically mounted on a modern smart phone (which acts as Platform). Other examples of sensors include the human eyes.

AGB Result
type: Class
subclass of: Result
subclass of: Restriction
  has value: Milligram Per Hectare
  on property: unit
subclass of: Restriction
  some values from: double
  on property: numeric value
comment: Result that normally is obtained by AGB sensors. Unit of measure Unit of measure Mg/ha (Milligram per Hectare)..

AGB UAV Observation
type: Class
subclass of: UAV Observation
subclass of: Restriction
  all values from: RS UAV LiDAR
  on property: made by sensor
subclass of: Restriction
  has value: Vegetation
  on property: has feature of interest
subclass of: Restriction
  has value: AGB
  on property: observed property
subclass of: Restriction
  on class: AGB Result
  qualified cardinality: 1
  on property: has result
comment: Class that represents observations related to AGB (Aboveground Biomass) . Unit of measure Mg/ha (Milligram per Hectare).

Anemometer
type: Class
subclass of: Ground Based Sensing
subclass of: Restriction
  has value: wind speed
  on property: observes
comment: Measures the direction [0º-360º] and the intensity (m/s) of the wind

Anemometer EddyCovariance
type: Class
subclass of: Anemometer
subclass of: Restriction
  all values from: EddyCovariance_Station
  on property: is hosted by
comment: Measures the intensity (m/s) of the wind

Atmosphere Property
type: Class
subclass of: Observable Property
comment: Class that represents all Atmosphere properties

Atmospheric Humidity AEMET Observation
type: Class
subclass of: Atmospheric Humidity Observation
subclass of: Restriction
  all values from: Hygrometer_AEMET
  on property: made by sensor
comment: Class that represents observations related to Atmospheric humidity in AEMET Station. Percent Relative Humidity

Atmospheric Humidity EddyCovariance Observation
type: Class
subclass of: Atmospheric Humidity Observation
subclass of: Restriction
  all values from: Hygrometer EddyCovariance
  on property: made by sensor
comment: Class that represents observations related to Atmospheric humidity in EddyCovariance Station (Gram Per Cubic Metre )

Atmospheric Humidity Observation
type: Class
subclass of: Ground based Observation
subclass of: Restriction
  has value: Air
  on property: has feature of interest
subclass of: Restriction
  has value: relative humidity
  on property: observed property
subclass of: Restriction
  on class: Atmospheric Humidity Result
  qualified cardinality: 1
  on property: has result
comment: Class that represents observations related to Atmospheric humidity.Unit of measure Percent Relative Humidity.

Atmospheric Humidity Result
type: Class
subclass of: Result
subclass of: Restriction
  has value: Percent Relative Humidity
  on property: unit
subclass of: Restriction
  some values from: double
  on property: numeric value
comment: Result that is normally obtained by Hygrometer sensors. Unit of measure Percent Relative Humidity.

Atmospheric Pressure AEMET Observation
type: Class
subclass of: Atmospheric Pressure Observation
subclass of: Restriction
  all values from: Barometer_AEMET
  on property: made by sensor
subclass of: Restriction
  on class: Atmospheric Pressure AEMET Result
  qualified cardinality: 1
  on property: has result
comment: Class that represents observations related to Atmospheric pressure in AEMET Station. Unit of measure Hectopascal (hPa).

Atmospheric Pressure AEMET Result
type: Class
subclass of: Result
subclass of: Restriction
  has value: Hectopascal
  on property: unit
subclass of: Restriction
  some values from: double
  on property: numeric value
comment: Result that is normally obtained by Barometer sensors. Unit of measure Hectopascal (hPa).

Atmospheric Pressure EddyCovariance Observation
type: Class
subclass of: Atmospheric Pressure Observation
subclass of: Restriction
  all values from: Barometer EddyCovariance
  on property: made by sensor
subclass of: Restriction
  on class: Atmospheric Pressure EddyCovariance Result
  qualified cardinality: 1
  on property: has result
comment: Class that represents observations related to Atmospheric pressure in EddyCovariance Station. Unit of measure Kilopascal (kPa).

Atmospheric Pressure EddyCovariance Result
type: Class
subclass of: Result
subclass of: Restriction
  has value: Kilopascal
  on property: unit
subclass of: Restriction
  some values from: double
  on property: numeric value
comment: Result that is normally obtained by Barometer sensors. Unit of measure Kilopascal (kPa).

Atmospheric Pressure Observation
type: Class
subclass of: Ground based Observation
subclass of: Restriction
  has value: Air
  on property: has feature of interest
subclass of: Restriction
  has value: air pressure
  on property: observed property
comment: Class that represents observations related to Atmospheric pressure

Barometer
type: Class
subclass of: Ground Based Sensing
subclass of: Restriction
  has value: air pressure
  on property: observes
comment: Measures pressure in hPa

Barometer EddyCovariance
type: Class
subclass of: Barometer
subclass of: Restriction
  all values from: EddyCovariance_Station
  on property: is hosted by
comment: Measures pressure in kPa. EddyCovariance Station.

CHM Result
type: Class
subclass of: Result
subclass of: Restriction
  has value: Meter
  on property: unit
subclass of: Restriction
  some values from: double
  on property: numeric value
comment: Result that normally is obtained by CHM sensors. Unit of measure Metre.

CHM UAV Observation
type: Class
subclass of: UAV Observation
subclass of: Restriction
  all values from: RS UAV LiDAR
  on property: made by sensor
subclass of: Restriction
  has value: Vegetation
  on property: has feature of interest
subclass of: Restriction
  has value: CHM
  on property: observed property
subclass of: Restriction
  on class: CHM Result
  qualified cardinality: 1
  on property: has result
comment: Class that represents observations related to CHM (Canopy Height Model). Unit of measure Metre.

CRI Result
type: Class
subclass of: Result
subclass of: Restriction
  has value: Number
  on property: unit
subclass of: Restriction
  some values from: double
  on property: numeric value
comment: Result that normally is obtained by CRI sensors. Dimensionless.

CRI UAV Observation
type: Class
subclass of: UAV Observation
subclass of: Restriction
  all values from: RS UAV Hyperspectral
  on property: made by sensor
subclass of: Restriction
  has value: Vegetation
  on property: has feature of interest
subclass of: Restriction
  has value: CRI
  on property: observed property
subclass of: Restriction
  on class: CRI Result
  qualified cardinality: 1
  on property: has result
comment: Class that represents observations related to CRI (Carotenoide). Dimensionless.

CarbonDioxideFlux g
type: Class
subclass of: Ground Based Sensing
subclass of: Restriction
  all values from: EddyCovariance_Station
  on property: is hosted by
subclass of: Restriction
  has value: Carbon_Dioxide_Flux
  on property: observes
comment: Sensor that takes carbon dioxide flow measurements

Carbon Dioxide Flux Observation
type: Class
subclass of: Ground based Observation
subclass of: Class
  union of: Restriction
    has value: Atmosphere of Earth
    on property: has feature of interest
  union of: Restriction
    has value: Soil
    on property: has feature of interest
  union of: Restriction
    has value: Vegetation
    on property: has feature of interest
subclass of: Restriction
  all values from: CarbonDioxideFlux g
  on property: made by sensor
subclass of: Restriction
  has value: Carbon_Dioxide_Flux
  on property: observed property
subclass of: Restriction
  on class: Carbon Dioxide flux Result
  qualified cardinality: 1
  on property: has result
comment: Class that represents observations related to Carbon dioxide flux (mg / (m2s))

Carbon Dioxide flux Result
type: Class
subclass of: Result
subclass of: Restriction
  has value: Milligrams per square metre per second
  on property: unit
subclass of: Restriction
  some values from: double
  on property: numeric value
comment: Result that is normally obtained by CarbonDioxideFlux (carbon dioxide flux) sensors. Unit of measure Milligrams per Square Metre per Second,

Chl L8 Observation
type: Class
subclass of: Chl Satellite Observation
subclass of: Restriction
  all values from: RS Landsat-8
  on property: made by sensor
comment: Class that represents observations related to Chlorophyll content. Micromoles of chlorophyll per square metre of leaf surface.
comment: Sensor that takes Chl measurements from Landsat-8.

Chl L9 Observation
type: Class
subclass of: Chl Satellite Observation
subclass of: Restriction
  all values from: RS Landsat-9
  on property: made by sensor
comment: Class that represents observations related to Chlorophyll content. Micromoles of chlorophyll per square metre of leaf surface.
comment: Sensor that takes Chl measurements from Lamdsat-9.

Chl Observation
type: Class
subclass of: Ground based Observation
subclass of: Restriction
  all values from: Chl g
  on property: made by sensor
subclass of: Restriction
  has value: Vegetation
  on property: has feature of interest
subclass of: Restriction
  has value: Chl
  on property: observed property
subclass of: Restriction
  on class: Chl Result
  qualified cardinality: 1
  on property: has result
comment: Class that represents observations related to Chlorophyll content. Micromoles of chlorophyll per square metre of leaf surface.

Chl Result
type: Class
subclass of: Result
subclass of: Restriction
  has value: Micromoles per square metre
  on property: unit
subclass of: Restriction
  some values from: double
  on property: numeric value
comment: Result that is normally obtained by Chl (Chlorophyll content) sensors. Micromoles of chlorophyll per square metre of leaf surface.Unit of measure Micromoles per Square Metre.

Chl S2 Observation
type: Class
subclass of: Chl Satellite Observation
subclass of: Restriction
  all values from: RS Sentinel-2
  on property: made by sensor
comment: Class that represents observations related to Chlorophyll content. Micromoles of chlorophyll per square metre of leaf surface.
comment: Sensor that takes Chlorophyll measurements from Sentinel-2.

Chl Satellite Observation
type: Class
subclass of: Satellite Observation
subclass of: Restriction
  has value: Vegetation
  on property: has feature of interest
subclass of: Restriction
  has value: Chl
  on property: observed property
subclass of: Restriction
  on class: Chl Satellite Result
  qualified cardinality: 1
  on property: has result
comment: Class that represents observations related to Chlorophyll content. Micromoles of chlorophyll per square metre of leaf surface.

Chl Satellite Result
type: Class
subclass of: Result
subclass of: Restriction
  has value: Number
  on property: unit
subclass of: Restriction
  some values from: double
  on property: numeric value
comment: Result that is normally obtained by Chl (Chlorophyll content) sensors. Micromoles of chlorophyll per square metre of leaf surface. Dimensionless.

Chl_Station
type: Class
subclass of: Ground Station
subclass of: Restriction
  all values from: Chl g
  on property: hosts
comment: Class that represents Chlorophyll content stations

Chl g
type: Class
subclass of: Ground Based Sensing
subclass of: Restriction
  all values from: Chl_Station
  on property: is hosted by
subclass of: Restriction
  has value: Chl
  on property: observes
comment: Sensor that takes Chlorophyll measurements. From Chl Station.

CloudMask METEOSAT Observation
type: Class
subclass of: Satellite Observation
subclass of: Restriction
  all values from: RS METEOSAT
  on property: made by sensor
subclass of: Restriction
  has value: Atmosphere of Earth
  on property: has feature of interest
subclass of: Restriction
  has value: cloud mask
  on property: observed property
subclass of: Restriction
  on class: CloudMask Result
  qualified cardinality: 1
  on property: has result
comment: Class that represents observations related to cloud mask. Dimensionless.
comment: Sensor that takes CloudMask measurements from METEOSAT.

CloudMask Result
type: Class
subclass of: Result
subclass of: Restriction
  has value: Number
  on property: unit
subclass of: Restriction
  some values from: double
  on property: numeric value
comment: Result that normally is obtained by CloudMask_METEOSAT sensors. Dimensionless.

CloudType METEOSAT Observation
type: Class
subclass of: Satellite Observation
subclass of: Restriction
  all values from: RS METEOSAT
  on property: made by sensor
subclass of: Restriction
  has value: Atmosphere of Earth
  on property: has feature of interest
subclass of: Restriction
  has value: cloud type
  on property: observed property
subclass of: Restriction
  on class: CloudType Result
  qualified cardinality: 1
  on property: has result
comment: Class that represents observations related to cloud mask. Dimensionless.
comment: Sensor that takes CloudType measurements from METEOSAT.

CloudType Result
type: Class
subclass of: Result
subclass of: Restriction
  has value: Number
  on property: unit
subclass of: Restriction
  some values from: double
  on property: numeric value
comment: Result that normally is obtained by by CloudType_METEOSAT sensors. Dimensionless.

Control Area
type: Class
subclass of: Feature
comment: A Control Area is a spatially delimited region designated to enable consistent environmental observations, calibration activities, and cross-platform validation. It provides a reference zone where measurements can be collected under controlled or well-characterized conditions.
example: Examples include small reference plots such as 1×1 m areas, or larger experimental regions such as 10×10 m areas, commonly used in field stations to support calibration and validation workflows

DBH Result
type: Class
subclass of: Result
subclass of: Restriction
  has value: Centimetre
  on property: unit
subclass of: Restriction
  some values from: double
  on property: numeric value
comment: Result that normally is obtained by DBH sensors. Unit of measure Centimetre.

DBH UAV Observation
type: Class
subclass of: UAV Observation
subclass of: Restriction
  all values from: RS UAV LiDAR
  on property: made by sensor
subclass of: Restriction
  has value: Vegetation
  on property: has feature of interest
subclass of: Restriction
  has value: DBH
  on property: observed property
subclass of: Restriction
  on class: DBH Result
  qualified cardinality: 1
  on property: has result
comment: Class that represents observations related to DBH (Diameter at Breast Height). Unit of measure Centimetre

DHP_Station
type: Class
subclass of: Ground Station
subclass of: Restriction
  all values from: Class
    union of: FAPAR dhp
    union of: FCOVER dhp
    union of: LAI dhp
  on property: hosts
comment: Class that represents Digital Hemispheric Picture (DHP) stations

DSM Result
type: Class
subclass of: Result
subclass of: Restriction
  has value: Meter
  on property: unit
subclass of: Restriction
  some values from: double
  on property: numeric value
comment: Result that normally is obtained by DSM sensors. Unit of measure Metre.

DSM UAV Observation
type: Class
subclass of: UAV Observation
subclass of: Restriction
  all values from: RS UAV LiDAR
  on property: made by sensor
subclass of: Restriction
  has value: Vegetation
  on property: has feature of interest
subclass of: Restriction
  has value: DSM
  on property: observed property
subclass of: Restriction
  on class: DSM Result
  qualified cardinality: 1
  on property: has result
comment: Class that represents observations related to DSM (Digital Surface Model).Unit of measure Metre.

DTM Result
type: Class
subclass of: Result
subclass of: Restriction
  has value: Meter
  on property: unit
subclass of: Restriction
  some values from: double
  on property: numeric value
comment: Result that normally is obtained by DTM sensors.Unit of measure Metre.

DTM UAV Observation
type: Class
subclass of: UAV Observation
subclass of: Restriction
  all values from: RS UAV LiDAR
  on property: made by sensor
subclass of: Restriction
  has value: Vegetation
  on property: has feature of interest
subclass of: Restriction
  has value: DTM
  on property: observed property
subclass of: Restriction
  on class: DTM Result
  qualified cardinality: 1
  on property: has result
comment: Class that represents observations related to DTM (Digital Terrain Model).Unit of measure Metre.

Diffuse Irradiance Observation
type: Class
subclass of: Ground based Observation
subclass of: Restriction
  all values from: I dif g
  on property: made by sensor
subclass of: Restriction
  has value: Radiation
  on property: has feature of interest
subclass of: Restriction
  has value: diffuse_irradiance
  on property: observed property
subclass of: Restriction
  on class: Diffuse Irradiance Result
  qualified cardinality: 1
  on property: has result
comment: Class that represents observations related to Diffuse radiation (W/m2)

Diffuse Irradiance Result
type: Class
subclass of: Result
subclass of: Restriction
  has value: Watt per Square Meter
  on property: unit
subclass of: Restriction
  some values from: double
  on property: numeric value
comment: Result that is normally obtained by I_dif sensors. Unit of measure Watt per Square Metre (W/m2).

Direct Irradiance Observation
type: Class
subclass of: Ground based Observation
subclass of: Restriction
  all values from: I dir g
  on property: made by sensor
subclass of: Restriction
  has value: Radiation
  on property: has feature of interest
subclass of: Restriction
  has value: direct_irradiance_at_the_surface
  on property: observed property
subclass of: Restriction
  on class: Direct Irradiance Result
  qualified cardinality: 1
  on property: has result
comment: Class that represents observations related to Direct solar radiation (W/m2)

Direct Irradiance Result
type: Class
subclass of: Result
subclass of: Restriction
  has value: Watt per Square Meter
  on property: unit
subclass of: Restriction
  some values from: double
  on property: numeric value
comment: Result that is normally obtained by I_dir sensors. Unit of measure Watt per Square Metre (W/m2).

DiseaseStatus Result
type: Class
subclass of: Result
subclass of: Restriction
  has value: Number
  on property: unit
subclass of: Restriction
  some values from: double
  on property: numeric value
comment: Result that normally is obtained by DiseaseStatus sensors. Dimensionless.

DiseaseStatus UAV Observation
type: Class
subclass of: UAV Observation
subclass of: Restriction
  all values from: RS UAV Hyperspectral
  on property: made by sensor
subclass of: Restriction
  has value: Vegetation
  on property: has feature of interest
subclass of: Restriction
  has value: DiseaseStatus
  on property: observed property
subclass of: Restriction
  on class: DiseaseStatus Result
  qualified cardinality: 1
  on property: has result
comment: Class that represents observations related to DiseaseStatus. Dimensionless.

Duration of Sunshine AEMET Result
type: Class
subclass of: Result
subclass of: Restriction
  has value: Hour
  on property: unit
subclass of: Restriction
  some values from: double
  on property: numeric value
comment: Result that is normally obtained by Heliograph sensors in AEMET Station. Unit of measure Hour.

EVI L8 Observation
type: Class
subclass of: EVI Satellite Observation
subclass of: Restriction
  all values from: RS Landsat-8
  on property: made by sensor
comment: Class that represents observations related to Enhanced Vegetation Index (EVI).
comment: Sensor that takes EVI measurements from Landsat-8.

EVI L9 Observation
type: Class
subclass of: EVI Satellite Observation
subclass of: Restriction
  all values from: RS Landsat-9
  on property: made by sensor
comment: Class that represents observations related to Enhanced Vegetation Index (EVI).
comment: Sensor that takes EVI measurements from Landsat-9.

EVI MODIS-Aqua Observation
type: Class
subclass of: EVI Satellite Observation
subclass of: Restriction
  all values from: RS MODIS-Aqua
  on property: made by sensor
comment: Class that represents observations related to Enhanced Vegetation Index (EVI).
comment: Daily temporality, resolution 500 m, product MYD09GA_006_EVI
comment: Sensor that takes Enhanced Vegetation Index (EVI) measurements from MODIS-Aqua.

EVI MODIS-Terra Observation
type: Class
subclass of: EVI Satellite Observation
subclass of: Restriction
  all values from: RS MODIS-Terra
  on property: made by sensor
comment: Class that represents observations related to Enhanced Vegetation Index (EVI).
comment: Daily temporality, 500 m resolution, product MYD09GA_006_EVI
comment: Sensor that takes Enhanced Vegetation Index (EVI) measurements from MODIS-Terra.

EVI Result
type: Class
subclass of: Result
subclass of: Restriction
  has value: Number
  on property: unit
subclass of: Restriction
  some values from: double
  on property: numeric value
comment: Result that is normally obtained by Enhanced Vegetation Index (EVI) sensors. Dimensionless.

EVI S2 Observation
type: Class
subclass of: EVI Satellite Observation
subclass of: Restriction
  all values from: RS Sentinel-2
  on property: made by sensor
comment: Class that represents observations related to Enhanced Vegetation Index (EVI).
comment: Sensor that takes EVI measurements from Sentinel-2.

EVI Satellite Observation
type: Class
subclass of: Satellite Observation
subclass of: Class
  union of: Restriction
    has value: Soil
    on property: has feature of interest
  union of: Restriction
    has value: Vegetation
    on property: has feature of interest
subclass of: Restriction
  has value: EVI
  on property: observed property
subclass of: Restriction
  on class: EVI Result
  qualified cardinality: 1
  on property: has result
comment: Class that represents observations related to Enhanced Vegetation Index (EVI). Dimensionless.

EVI UAV Observation
type: Class
subclass of: UAV Observation
subclass of: Class
  union of: Restriction
    has value: Soil
    on property: has feature of interest
  union of: Restriction
    has value: Vegetation
    on property: has feature of interest
subclass of: Restriction
  all values from: RS UAV Multispectral
  on property: made by sensor
subclass of: Restriction
  has value: EVI
  on property: observed property
subclass of: Restriction
  on class: EVI Result
  qualified cardinality: 1
  on property: has result
comment: Class that represents observations related to Enhanced Vegetation Index (EVI). DImensionless.

EddyCovariance_Station
type: Class
subclass of: Ground Station
subclass of: Restriction
  all values from: Class
    union of: Anemometer EddyCovariance
    union of: Barometer EddyCovariance
    union of: CarbonDioxideFlux g
    union of: Hs g
    union of: Hygrometer EddyCovariance
    union of: LE g
    union of: Thermometer EddyCovariance
    union of: WaterVapourFlux g
    union of: WindVane_AEMET
  on property: hosts
comment: Eddy covariance systems measure the exchange of CO2, H2O, CH4 , and energy between the earth’s surface and the atmosphere, empowering researchers to advance scientific understanding of climate and ecosystem dynamics

FAPAR L8 Observation
type: Class
subclass of: FAPAR Satellite Observation
subclass of: Restriction
  all values from: RS Landsat-8
  on property: made by sensor
comment: Class that represents observations related to fraction of absorved photosynthetically active radiation (FAPAR). Dimensionless.
comment: Sensor that takes FAPAR measurements from Landsat-8.

FAPAR L9 Observation
type: Class
subclass of: FAPAR Satellite Observation
subclass of: Restriction
  all values from: RS Landsat-9
  on property: made by sensor
comment: Class that represents observations related to fraction of absorved photosynthetically active radiation (FAPAR). Dimensionless.
comment: Sensor that takes FAPAR measurements from Landsat-9.

FAPAR MODIS-Aqua Observation
type: Class
subclass of: FAPAR Satellite Observation
subclass of: Restriction
  all values from: RS MODIS-Aqua
  on property: made by sensor
comment: Class that represents observations related to fraction of absorved photosynthetically active radiation (FAPAR). Dimensionless.
comment: Sensor that takes FAPAR measurements from MODIS-Aqua.
comment: Temporality 8 days, resolution 500 m, product MYD15A2H

FAPAR MODIS-Terra Observation
type: Class
subclass of: FAPAR Satellite Observation
subclass of: Restriction
  all values from: RS MODIS-Terra
  on property: made by sensor
comment: Class that represents observations related to fraction of absorved photosynthetically active radiation (FAPAR). Dimensionless.
comment: Sensor that takes FAPAR measurements from MODIS-Terra.
comment: Temporality 8 days, resolution 500 m, product MYD15A2H

FAPAR Observation
type: Class
subclass of: Ground based Observation
subclass of: Restriction
  has value: Vegetation
  on property: has feature of interest
subclass of: Restriction
  has value: FAPAR
  on property: observed property
subclass of: Restriction
  on class: FAPAR Result
  qualified cardinality: 1
  on property: has result
comment: Class that represents observations related to fraction of absorved photosynthetically active radiation (FAPAR). Dimensionless.

FAPAR Result
type: Class
subclass of: Result
subclass of: Restriction
  has value: Number
  on property: unit
subclass of: Restriction
  some values from: double
  on property: numeric value
comment: Result that normally is obtained by fraction of absorved photosynthetically active radiation (FAPAR) sensors. Dimensionless.

FAPAR S2 Observation
type: Class
subclass of: FAPAR Satellite Observation
subclass of: Restriction
  all values from: RS Sentinel-2
  on property: made by sensor
comment: Class that represents observations related to fraction of absorved photosynthetically active radiation (FAPAR). Dimensionless.
comment: Sensor that takes FAPAR measurements from Sentinel-2.

FAPAR Satellite Observation
type: Class
subclass of: Satellite Observation
subclass of: Restriction
  has value: Vegetation
  on property: has feature of interest
subclass of: Restriction
  has value: FAPAR
  on property: observed property
subclass of: Restriction
  on class: FAPAR Result
  qualified cardinality: 1
  on property: has result
comment: Class that represents observations related to fraction of absorved photosynthetically active radiation (FAPAR). Dimensionless.

FAPAR_Station
type: Class
subclass of: Ground Station
subclass of: Restriction
  all values from: FAPAR g
  on property: hosts
comment: Class that represents fraction of absorved photosynthetically active radiation stations

FAPAR UAV Observation
type: Class
subclass of: UAV Observation
subclass of: Restriction
  all values from: RS UAV Multispectral
  on property: made by sensor
subclass of: Restriction
  has value: Vegetation
  on property: has feature of interest
subclass of: Restriction
  has value: FAPAR
  on property: observed property
subclass of: Restriction
  on class: FAPAR Result
  qualified cardinality: 1
  on property: has result
comment: Class that represents observations related to fraction of absorved photosynthetically active radiation (FAPAR). Dimensionless.

FAPAR dhp
type: Class
subclass of: Ground Based Sensing
subclass of: Restriction
  all values from: DHP_Station
  on property: is hosted by
subclass of: Restriction
  has value: FAPAR
  on property: observes
comment: Sensor that takes fraction of surface downwelling photosynthetic radiative measurements. From Digital Hemispheric Picture (DHP) Station.

FAPAR dhp Observation
type: Class
subclass of: FAPAR Observation
subclass of: Restriction
  all values from: FAPAR dhp
  on property: made by sensor
comment: Class that represents observations related to fraction of absorved photosynthetically active radiation (FAPAR). Dimensionless.

FAPAR g
type: Class
subclass of: Ground Based Sensing
subclass of: Restriction
  all values from: FAPAR_Station
  on property: is hosted by
subclass of: Restriction
  has value: FAPAR
  on property: observes
comment: Sensor that takes fraction of surface downwelling photosynthetic radiative measurements

FAPAR g Observation
type: Class
subclass of: FAPAR Observation
subclass of: Restriction
  all values from: FAPAR g
  on property: made by sensor
comment: Class that represents observations related to fraction of absorved photosynthetically active radiation (FAPAR). Dimensionless.

FCOVER Result
type: Class
subclass of: Result
subclass of: Restriction
  has value: Number
  on property: unit
subclass of: Restriction
  some values from: double
  on property: numeric value
comment: Result that normally is obtained by FCOVER sensors. Dimensionless.

FCOVER dhp
type: Class
subclass of: Ground Based Sensing
subclass of: Restriction
  all values from: DHP_Station
  on property: is hosted by
subclass of: Restriction
  has value: vegetation area fraction
  on property: observes
comment: Sensor that takes vegetation area fraction measurements. From Digital Hemispheric Picture (DHP) Station

FCOVER dhp Observation
type: Class
subclass of: Ground based Observation
subclass of: Restriction
  all values from: FCOVER dhp
  on property: made by sensor
subclass of: Restriction
  has value: Vegetation
  on property: has feature of interest
subclass of: Restriction
  has value: vegetation area fraction
  on property: observed property
subclass of: Restriction
  on class: FCOVER Result
  qualified cardinality: 1
  on property: has result
comment: Class that represents observations related to FCOVER. Dimensionless.

GIFAPAR Result
type: Class
subclass of: Result
subclass of: Restriction
  has value: Number
  on property: unit
subclass of: Restriction
  some values from: double
  on property: numeric value
comment: Result that normally is obtained by Green Instantaneous Fraction of Absorved photosynthetically active Radiation (GIFAPAR) sensors. In this ontology by the Remote Sensing from Sentinel-3 OLCI ( RS_Sentinel-3_OLCI). Dimesionless.

GIFAPAR S3 Observation
type: Class
subclass of: GIFAPAR Satellite Observation
subclass of: Restriction
  all values from: RS Sentinel-3 OLCI
  on property: made by sensor
comment: Class that represents observations related to Green Instantaneous Fraction of Absorbed Photosynthetically Active Radiation (GI-FAPAR) (300 m de resolution)). Dimensionless.
comment: Sensor that takes GIFAPAR measurements from Sentinel-3.

GIFAPAR Satellite Observation
type: Class
subclass of: Satellite Observation
subclass of: Restriction
  has value: Vegetation
  on property: has feature of interest
subclass of: Restriction
  has value: FAPAR
  on property: observed property
subclass of: Restriction
  on class: GIFAPAR Result
  qualified cardinality: 1
  on property: has result
comment: Class that represents observations related to fraction of absorved photosynthetically active radiation (FAPAR). Dimensionless.

Ground Based Sensing
type: Class
subclass of: Sensor
comment: Ground Base Sensors

Ground Station
type: Class
subclass of: Platform
subclass of: Restriction
  on class: Control Area
  qualified cardinality: 1
  on property: controlArea
subclass of: Restriction
  on class: Land Cover Classes
  qualified cardinality: 1
  on property: hasTypeOfCover
comment: A Ground Station is defined as a physical platform located on the Earth’s surface that hosts one or more sensors used to perform in-situ environmental observations.

Ground based Observation
type: Class
subclass of: Observation
comment: Observation collected in situ.

Hs g
type: Class
subclass of: Ground Based Sensing
subclass of: Restriction
  all values from: EddyCovariance_Station
  on property: is hosted by
subclass of: Restriction
  has value: sensible_heat_flux
  on property: observes
comment: Sensor that takes sensible heat flux measurements

Hygrometer
type: Class
subclass of: Ground Based Sensing
subclass of: Restriction
  has value: relative humidity
  on property: observes
comment: Measures relative humidity in %

Hygrometer EddyCovariance
type: Class
subclass of: Hygrometer
subclass of: Restriction
  all values from: EddyCovariance_Station
  on property: is hosted by
comment: Sensor belongs to EddyCovariance Station. Measures relative humidity in %

I dif g
type: Class
subclass of: Ground Based Sensing
subclass of: Restriction
  all values from: RAD_Station
  on property: is hosted by
subclass of: Restriction
  has value: diffuse_irradiance
  on property: observes
comment: Sensor that takes "diffuse irradiance at the surface" measurements in RAD Station

I dir g
type: Class
subclass of: Ground Based Sensing
subclass of: Restriction
  all values from: RAD_Station
  on property: is hosted by
subclass of: Restriction
  has value: direct_irradiance_at_the_surface
  on property: observes
comment: Sensor that takes "direct irradiance at the surface" measurements in RAD Station

Image Result
type: Class
subclass of: Result
subclass of: Restriction
  has value: Number
  on property: unit
subclass of: Restriction
  some values from: anyURI
  on property: URLImage
comment: Image Result let us assign URIs to the image properties. Dimensionless.

Insolation AEMET Observation
type: Class
subclass of: Ground based Observation
subclass of: Restriction
  all values from: Heliograph_AEMET
  on property: made by sensor
subclass of: Restriction
  has value: Atmosphere of Earth
  on property: has feature of interest
subclass of: Restriction
  has value: duration of sunshine
  on property: observed property
subclass of: Restriction
  on class: Duration of Sunshine AEMET Result
  qualified cardinality: 1
  on property: has result
comment: Class that represents observations related to Heliograph (Duration of the sunshine in Hours).

LAI L8 Observation
type: Class
subclass of: LAI Satellite Observation
subclass of: Restriction
  all values from: RS Landsat-8
  on property: made by sensor
comment: Class that represents observations related to Leaf Area Index (LAI). Dimensionless.
comment: Sensor that takes LAI measurements from Landsat-8.

LAI L9 Observation
type: Class
subclass of: LAI Satellite Observation
subclass of: Restriction
  all values from: RS Landsat-9
  on property: made by sensor
comment: Class that represents observations related to Leaf Area Index (LAI). Dimensionless.
comment: Sensor that takes LAI measurements from Landsat-9.

LAI Observation
type: Class
subclass of: Ground based Observation
subclass of: Restriction
  has value: Vegetation
  on property: has feature of interest
subclass of: Restriction
  has value: LAI
  on property: observed property
subclass of: Restriction
  on class: LAI Result
  qualified cardinality: 1
  on property: has result
comment: Class that represents observations related to Leaf Area Index (LAI). Dimensionless.

LAI Result
type: Class
subclass of: Result
subclass of: Restriction
  has value: Number
  on property: unit
subclass of: Restriction
  some values from: double
  on property: numeric value
comment: Result that is normally obtained by Leaf Area Index (LAI) sensors. Dimensionless.

LAI S2 Observation
type: Class
subclass of: LAI Satellite Observation
subclass of: Restriction
  all values from: RS Sentinel-2
  on property: made by sensor
comment: Class that represents observations related to Leaf Area Index (LAI). Dimensionless.
comment: Sensor that takes LAI measurements from Sentinel-2.

LAI Satellite Observation
type: Class
subclass of: Satellite Observation
subclass of: Restriction
  has value: Vegetation
  on property: has feature of interest
subclass of: Restriction
  has value: LAI
  on property: observed property
subclass of: Restriction
  on class: LAI Result
  qualified cardinality: 1
  on property: has result
comment: Class that represents observations related to Leaf Area Index (LAI). Dimensionless.

LAI_Station
type: Class
subclass of: Ground Station
subclass of: Restriction
  all values from: LAI g
  on property: hosts
comment: Class that represents Leaf Aea Index (LAI) stations

LAI UAV Observation
type: Class
subclass of: UAV Observation
subclass of: Restriction
  all values from: RS UAV Multispectral
  on property: made by sensor
subclass of: Restriction
  has value: Vegetation
  on property: has feature of interest
subclass of: Restriction
  has value: LAI
  on property: observed property
subclass of: Restriction
  on class: LAI Result
  qualified cardinality: 1
  on property: has result
comment: Class that represents observations related to Leaf Area Index (LAI). Dimensionless.

LAI dhp
type: Class
subclass of: Ground Based Sensing
subclass of: Restriction
  all values from: DHP_Station
  on property: is hosted by
subclass of: Restriction
  has value: LAI
  on property: observes
comment: Leaf Area Index Sensor from Digital Hemispheric Picture (DHP) Station

LAI dhp Observation
type: Class
subclass of: LAI Observation
subclass of: Restriction
  all values from: LAI dhp
  on property: made by sensor
comment: Class that represents observations related to Leaf Area Index (LAI). Dimensionless.

LAI g
type: Class
subclass of: Ground Based Sensing
subclass of: Restriction
  all values from: LAI_Station
  on property: is hosted by
subclass of: Restriction
  has value: LAI
  on property: observes
comment: Leaf Area Index Sensor from Leaf Area Index (LAI) Station

LAI g Observation
type: Class
subclass of: LAI Observation
subclass of: Restriction
  all values from: LAI g
  on property: made by sensor
comment: Class that represents observations related to Leaf Area Index (LAI). Dimensionless.

LE g
type: Class
subclass of: Ground Based Sensing
subclass of: Restriction
  all values from: EddyCovariance_Station
  on property: is hosted by
subclass of: Restriction
  has value: upward latent heat flux in air
  on property: observes
comment: Sensor that takes evapotranspiration measurements

LSE Observation
type: Class
subclass of: Ground based Observation
subclass of: Class
  union of: Restriction
    has value: Soil
    on property: has feature of interest
  union of: Restriction
    has value: Vegetation
    on property: has feature of interest
subclass of: Restriction
  all values from: LSE g
  on property: made by sensor
subclass of: Restriction
  has value: surface longwave emissivity
  on property: observed property
subclass of: Restriction
  on class: LSE Result
  qualified cardinality: 1
  on property: has result
comment: Class that represents observations related to Land Surface Emissivity. Dimensionless.

LSE Result
type: Class
subclass of: Result
subclass of: Restriction
  has value: Number
  on property: unit
subclass of: Restriction
  some values from: double
  on property: numeric value
comment: Result that is normally obtained by Land Surface Emissivity (LSE) sensors. Dimensionless.

LSE_Station
type: Class
subclass of: Ground Station
subclass of: Restriction
  all values from: LSE g
  on property: hosts
comment: Class that represents Land Surface Emissivity (LSE) stations

LSE g
type: Class
subclass of: Ground Based Sensing
subclass of: Restriction
  all values from: LSE_Station
  on property: is hosted by
subclass of: Restriction
  has value: surface longwave emissivity
  on property: observes
comment: Sensor that takes Land Surface Emissivity measurements

LST 8days 1km MODIS-Aqua Observation
type: Class
subclass of: LST Satellite Observation
subclass of: Restriction
  all values from: RS MODIS-Aqua
  on property: made by sensor
comment: Class that represents observations related to Land Surface Temperature (LST). Celsius Degree.
comment: 8 days temporality, 1 km resolution. Product MYD11A2.
comment: Sensor that takes Land Surface Temperature measurements from MODIS-Aqua.

LST 8days 1km MODIS-Terra Observation
type: Class
subclass of: LST Satellite Observation
subclass of: Restriction
  all values from: RS MODIS-Terra
  on property: made by sensor
comment: Class that represents observations related to Land Surface Temperature (LST). Celsius Degree.
comment: 8 days temporality, 1 km resolution. Product MYD11A2.
comment: Sensor that takes Land Surface Temperature measurements from MODIS-Terra.

LST L8 Observation
type: Class
subclass of: LST Satellite Observation
subclass of: Restriction
  all values from: RS Landsat-8
  on property: made by sensor
comment: Class that represents observations related to Land Surface Temperature (LST). Celsius Degree.
comment: Sensor that takes LST measurements from Landset-8.

LST L9 Observation
type: Class
subclass of: LST Satellite Observation
subclass of: Restriction
  all values from: RS Landsat-9
  on property: made by sensor
comment: Class that represents observations related to Land Surface Temperature (LST). Celsius Degree.
comment: Sensor that takes LST measurements from Landset-9.

LST Observation
type: Class
subclass of: Ground based Observation
subclass of: Class
  union of: Restriction
    has value: Soil
    on property: has feature of interest
  union of: Restriction
    has value: Vegetation
    on property: has feature of interest
subclass of: Restriction
  all values from: LST g
  on property: made by sensor
subclass of: Restriction
  has value: LST
  on property: observed property
subclass of: Restriction
  on class: LST Result
  qualified cardinality: 1
  on property: has result
comment: Class that represents observations related to Land Surface Temperature (LST). Celsius Degree.

LST Result
type: Class
subclass of: Result
subclass of: Restriction
  has value: Degree Celsius
  on property: unit
subclass of: Restriction
  some values from: double
  on property: numeric value
comment: Result that is normally obtained by Land Surface Temperature (LST) sensors. Unit of measure Degree Celsius .

LST S3 Observation
type: Class
subclass of: LST Satellite Observation
subclass of: Restriction
  all values from: RS Sentinel-3 SLSTR
  on property: made by sensor
comment: Class that represents observations related to Land Surface Temperature (LST). Celsius Degree.
comment: Sensor that takes LST measurements from Sentinel-3.

LST Satellite Observation
type: Class
subclass of: Satellite Observation
subclass of: Class
  union of: Restriction
    has value: Soil
    on property: has feature of interest
  union of: Restriction
    has value: Vegetation
    on property: has feature of interest
subclass of: Restriction
  has value: LST
  on property: observed property
subclass of: Restriction
  on class: LST Result
  qualified cardinality: 1
  on property: has result
comment: Class that represents observations related to Land Surface Temperature (LST). Celsius Degree.

LST_Station
type: Class
subclass of: Ground Station
subclass of: Restriction
  all values from: LST g
  on property: hosts
comment: Class that represents Land Surface Temperature (LST) stations

LST UAV Observation
type: Class
subclass of: UAV Observation
subclass of: Class
  union of: Restriction
    has value: Soil
    on property: has feature of interest
  union of: Restriction
    has value: Vegetation
    on property: has feature of interest
subclass of: Restriction
  all values from: RS UAV Thermal
  on property: made by sensor
subclass of: Restriction
  has value: LST
  on property: observed property
subclass of: Restriction
  on class: LST Result
  qualified cardinality: 1
  on property: has result
comment: Class that represents observations related to Land Surface Temperature (LST). Unit of measure Degree Celsius.

LST diary 1km MODIS-Aqua Observation
type: Class
subclass of: LST Satellite Observation
subclass of: Restriction
  all values from: RS MODIS-Aqua
  on property: made by sensor
comment: Class that represents observations related to Land Surface Temperature (LST). Celsius Degree.
comment: Daily temporality,1 km resolution. Product MYD11A1
comment: Sensor that takes Land Surface Temperature measurements from MODIS-Aqua.

LST diary 1km MODIS-Terra Observation
type: Class
subclass of: LST Satellite Observation
subclass of: Restriction
  all values from: RS MODIS-Terra
  on property: made by sensor
comment: Class that represents observations related to Land Surface Temperature (LST). Celsius Degree.
comment: Daily temporality,1 km resolution. Product MYD11A1
comment: Sensor that takes Land Surface Temperature measurements from MODIS-Terra.

LST g
type: Class
subclass of: Ground Based Sensing
subclass of: Restriction
  all values from: LST_Station
  on property: is hosted by
subclass of: Restriction
  has value: LST
  on property: observes
comment: Sensor that takes Land Surface Temperature measurements

LW down g
type: Class
subclass of: Ground Based Sensing
subclass of: Restriction
  all values from: RAD_Station
  on property: is hosted by
subclass of: Restriction
  has value: surface downwelling longwave flux in air
  on property: observes
comment: Sensor that takes "surface downwelling longwave flux in air" measurements in RAD Station

LW up g
type: Class
subclass of: Ground Based Sensing
subclass of: Restriction
  all values from: RAD_Station
  on property: is hosted by
subclass of: Restriction
  has value: upwelling longwave flux in air
  on property: observes
comment: Sensor that takes "upwelling longwave flux in air" measurements in RAD Station

LandCover Result
type: Class
subclass of: Result
subclass of: Class
  intersection of: Restriction
    some values from: anyURI
    on property: URL10x10
  intersection of: Restriction
    some values from: anyURI
    on property: URL1x1
subclass of: Restriction
  has value: Number
  on property: unit
comment: Result that is normally obtained by LandCover_S2 sensors. Dimensionless.

LandCover S2 Observation
type: Class
subclass of: Satellite Observation
subclass of: Restriction
  all values from: RS Sentinel-2
  on property: made by sensor
subclass of: Restriction
  has value: Soil
  on property: has feature of interest
subclass of: Restriction
  has value: Vegetation
  on property: has feature of interest
subclass of: Restriction
  has value: Landcover
  on property: observed property
subclass of: Restriction
  on class: LandCover Result
  qualified cardinality: 1
  on property: has result
comment: Class that represents observations related to Land Cover LCCS.
comment: Sensor that takes LandCover measurements from Sentinel-2. Dimensionless.

Land Atmosphere Interaction Property
type: Class
subclass of: Observable Property
comment: Class that represents all Land Atmosphere Interation properties

Land Cover Classes
type: Class
equivalent class: Class
  one of: Artificial Surfaces
  one of: Bare Soils
  one of: Coniferous Forest
  one of: Non-irrigated arable land
  one of: Permanently irrigated land
  one of: Sclerophyllous vegetation
  one of: Vineyards
  one of: Fruit trees and berry plantations (olive, almond)
comment: Land Cover Classes, Level 3

Land Cover Property
type: Class
subclass of: Observable Property
comment: Class that represents all Land Cover properties
comment: Land cover is the physical material on the earth's surface. Ground covers include grass, asphalt, trees, bare ground, water, etc. Land cover is the expression used by the ecologist Frederick Edward Clements that has its closest modern equivalent to vegetation.

Land Surface Property
type: Class
subclass of: Observable Property
comment: Class that represents all Land Surface properties (Temperature, Emissivity, Aspect , Slope, Elevation ...)

Landsat-8
type: Class
subclass of: Satellite

Landsat-8_Product
type: Class
subclass of: Satellite Product
comment: Class that represents Landsat-8 products

Landsat-9
type: Class
subclass of: Satellite

Landsat-8_Product
type: Class
subclass of: Satellite Product
comment: Class that represents Landsat-9 Products

Latent Heat Flux Observation
type: Class
subclass of: Ground based Observation
subclass of: Class
  union of: Restriction
    has value: Atmosphere of Earth
    on property: has feature of interest
  union of: Restriction
    has value: Soil
    on property: has feature of interest
  union of: Restriction
    has value: Vegetation
    on property: has feature of interest
subclass of: Restriction
  all values from: LE g
  on property: made by sensor
subclass of: Restriction
  has value: upward latent heat flux in air
  on property: observed property
subclass of: Restriction
  on class: Latent Heat Flux Result
  qualified cardinality: 1
  on property: has result
comment: Class that represents observations related to Latent Heat Flux (W/m2).

Latent Heat Flux Result
type: Class
subclass of: Result
subclass of: Restriction
  has value: Watt per Square Meter
  on property: unit
subclass of: Restriction
  some values from: double
  on property: numeric value
comment: Result that is normally obtained by LE_g (evapotranspiration ground) sensors. Unit of measure Watt per Square Metre (W/m2).

METEOSAT
type: Class
subclass of: Satellite

METEOSAT_Product
type: Class
subclass of: Satellite Product
comment: Class that represents METEOSAT Products @es

MODIS-Aqua
type: Class
subclass of: Satellite

MODIS-Aqua_Product
type: Class
subclass of: Satellite Product
comment: Class that represents MODIS-Aqua Products

MODIS-Terra
type: Class
subclass of: Satellite

MODIS-Terra_Product
type: Class
subclass of: Satellite Product
comment: Class that represents MODIS-Terra Products

N2_Station
type: Class
subclass of: Ground Station
subclass of: Restriction
  all values from: N2 g
  on property: hosts
comment: Class that represents Nitrogen concentration stations

N2 g
type: Class
subclass of: Ground Based Sensing
subclass of: Restriction
  all values from: N2_Station
  on property: is hosted by
subclass of: Restriction
  has value: Nitrogen_Concentration
  on property: observes
comment: Sensor that takes nitrogen dioxide measurements. From N2 Station.

NDVI 16days 1km MODIS-Aqua Observation
type: Class
subclass of: NDVI Satellite Observation
subclass of: Restriction
  all values from: RS MODIS-Aqua
  on property: made by sensor
comment: Class that represents observations related to Normalized Difference Vegetation Index (NDVI).
comment: 16 days temporality, 1km resolution, product MYD13A2
comment: Sensor that takes NDVI measurements from MODIS-Aqua.

NDVI 16days 1km MODIS-Terra Observation
type: Class
subclass of: NDVI Satellite Observation
subclass of: Restriction
  all values from: RS MODIS-Terra
  on property: made by sensor
comment: Class that represents observations related to Normalized Difference Vegetation Index (NDVI).
comment: 16 days temporality, 1 km resolution. Producto MYD13A2
comment: Sensor that takes NDVI measurements from MODIS-Terra.

NDVI 16days 250m MODIS-Aqua Observation
type: Class
subclass of: NDVI Satellite Observation
subclass of: Restriction
  all values from: RS MODIS-Aqua
  on property: made by sensor
comment: Class that represents observations related to Normalized Difference Vegetation Index (NDVI).
comment: 16 days temporality, 250 m resolution, product MYD13Q1
comment: Sensor that takes NDVI measurements from MODIS-Aqua.

NDVI 16days 250m MODIS-Terra Observation
type: Class
subclass of: NDVI Satellite Observation
subclass of: Restriction
  all values from: RS MODIS-Terra
  on property: made by sensor
comment: Class that represents observations related to Normalized Difference Vegetation Index (NDVI).
comment: 16 days temporality, 250 m resolution. Producto MYD13Q1
comment: Sensor that takes NDVI measurements from MODIS-Terra.

NDVI 16days 500m MODIS-Aqua Observation
type: Class
subclass of: NDVI Satellite Observation
subclass of: Restriction
  all values from: RS MODIS-Aqua
  on property: made by sensor
comment: Class that represents observations related to Normalized Difference Vegetation Index (NDVI).
comment: 16 days temporality, 500 m resolution, product MYD13A1
comment: Sensor that takes NDVI measurements from MODIS-Aqua.

NDVI 16days 500m MODIS-Terra Observation
type: Class
subclass of: NDVI Satellite Observation
subclass of: Restriction
  all values from: RS MODIS-Terra
  on property: made by sensor
comment: Class that represents observations related to Normalized Difference Vegetation Index (NDVI).
comment: 16 days temporality, 500 m resolution. Product MYD13A1
comment: Sensor that takes NDVI measurements from MODIS-Terra.

NDVI L8 Observation
type: Class
subclass of: NDVI Satellite Observation
subclass of: Restriction
  all values from: RS Landsat-8
  on property: made by sensor
comment: Class that represents observations related to Normalized Difference Vegetation Index (NDVI).
comment: Sensor that takes NDVI measurements from Landsat-8.

NDVI L9 Observation
type: Class
subclass of: NDVI Satellite Observation
subclass of: Restriction
  all values from: RS Landsat-9
  on property: made by sensor
comment: Class that represents observations related to Normalized Difference Vegetation Index (NDVI).
comment: Sensor that takes NDVI measurements from Landsat-9.

NDVI Result
type: Class
subclass of: Result
subclass of: Restriction
  has value: Number
  on property: unit
subclass of: Restriction
  some values from: double
  on property: numeric value
comment: Result that is normally obtained by Normalized Difference Vegetation Index (NDVI) sensors. Dimensionless.

NDVI S2 Observation
type: Class
subclass of: NDVI Satellite Observation
subclass of: Restriction
  all values from: RS Sentinel-2
  on property: made by sensor
comment: Class that represents observations related to Normalized Difference Vegetation Index (NDVI).
comment: Sensor that takes NDVI measurements from Sentinel-2.

NDVI Satellite Observation
type: Class
subclass of: Satellite Observation
subclass of: Class
  union of: Restriction
    has value: Soil
    on property: has feature of interest
  union of: Restriction
    has value: Vegetation
    on property: has feature of interest
subclass of: Restriction
  has value: NDVI
  on property: observed property
subclass of: Restriction
  on class: NDVI Result
  qualified cardinality: 1
  on property: has result
comment: Class that represents observations related to Normalized Difference Vegetation Index (NDVI). Dimensionless.

NDVI UAV Observation
type: Class
subclass of: UAV Observation
subclass of: Class
  union of: Restriction
    has value: Soil
    on property: has feature of interest
  union of: Restriction
    has value: Vegetation
    on property: has feature of interest
subclass of: Restriction
  all values from: RS UAV Multispectral
  on property: made by sensor
subclass of: Restriction
  has value: NDVI
  on property: observed property
subclass of: Restriction
  on class: NDVI Result
  qualified cardinality: 1
  on property: has result
comment: Class that represents observations related to Normalized Difference Vegetation Index (NDVI). Dimensionless.

NDVI diary 500m MODIS-Aqua Observation
type: Class
subclass of: NDVI Satellite Observation
subclass of: Restriction
  all values from: RS MODIS-Aqua
  on property: made by sensor
comment: Class that represents observations related to Normalized Difference Vegetation Index (NDVI).
comment: Diary temporality, 500 m resolution, product MYD09GA_006_NDVI
comment: Sensor that takes NDVI measurements from MODIS-Aqua.

NDVI diary 500m MODIS-Terra Observation
type: Class
subclass of: NDVI Satellite Observation
subclass of: Restriction
  all values from: RS MODIS-Terra
  on property: made by sensor
comment: Class that represents observations related to Normalized Difference Vegetation Index (NDVI).
comment: Daily temporality, 500 m resolution. Product MYD09GA_006_NDVI
comment: Sensor that takes NDVI measurements from MODIS-Terra.

NDWI Result
type: Class
subclass of: Result
subclass of: Restriction
  has value: Number
  on property: unit
subclass of: Restriction
  some values from: double
  on property: numeric value
comment: Result that normally is obtained by NDWI sensors. Dimensionless.

NDWI UAV Observation
type: Class
subclass of: UAV Observation
subclass of: Restriction
  all values from: RS UAV Hyperspectral
  on property: made by sensor
subclass of: Restriction
  has value: Vegetation
  on property: has feature of interest
subclass of: Restriction
  has value: NDWI
  on property: observed property
subclass of: Restriction
  on class: NDWI Result
  qualified cardinality: 1
  on property: has result
comment: Class that represents observations related to NDWI – Normalized Difference Water Index. Dimensionless.

NRI Result
type: Class
subclass of: Result
subclass of: Restriction
  has value: Number
  on property: unit
subclass of: Restriction
  some values from: double
  on property: numeric value
comment: Result that normally is obtained by NRI sensors. Dimensionless.

NRI UAV Observation
type: Class
subclass of: UAV Observation
subclass of: Restriction
  all values from: RS UAV Hyperspectral
  on property: made by sensor
subclass of: Restriction
  has value: Vegetation
  on property: has feature of interest
subclass of: Restriction
  has value: NRI
  on property: observed property
subclass of: Restriction
  on class: NRI Result
  qualified cardinality: 1
  on property: has result
comment: Class that represents observations related to NRI (Nitrogen Reflectance Index).Dimensionless.

Nitrogen Concentration Observation
type: Class
subclass of: Ground based Observation
subclass of: Restriction
  all values from: N2 g
  on property: made by sensor
subclass of: Restriction
  has value: Vegetation
  on property: has feature of interest
subclass of: Restriction
  has value: Nitrogen_Concentration
  on property: observed property
subclass of: Restriction
  on class: Nitrogen Concentration Result
  qualified cardinality: 1
  on property: has result
comment: Class that represents observations related to Nitrogen dioxide concentration (mg/g).

Nitrogen Concentration Result
type: Class
subclass of: Result
subclass of: Restriction
  has value: Milligram Per Gram
  on property: unit
subclass of: Restriction
  some values from: double
  on property: numeric value
comment: Result that is normally obtained by N2 (nitrogene dioxide) sensors. Unit of measure Milligram per Gram.

ORTHOPHOTO UAV Observation
type: Class
subclass of: UAV Observation
subclass of: Class
  union of: Restriction
    has value: Soil
    on property: has feature of interest
  union of: Restriction
    has value: Vegetation
    on property: has feature of interest
subclass of: Restriction
  all values from: RS UAV RGB
  on property: made by sensor
subclass of: Restriction
  has value: Orthophoto
  on property: observed property
subclass of: Restriction
  on class: Image Result
  qualified cardinality: 1
  on property: has result
comment: Class that represents observations related to Orthophoto. Dimensionless.

OTCI S3 Observation
type: Class
subclass of: Chl Satellite Observation
subclass of: Restriction
  all values from: RS Sentinel-3 OLCI
  on property: made by sensor
comment: Class that represents observations related to OLCI Terrestrial Chlorophyll Index (OTCI) (300 m de resolución)). µmol of chlorophyll per m²µ.
comment: Sensor that takes OTCI measurements from Sentinel-3.

PWC METEOSAT Observation
type: Class
subclass of: Satellite Observation
subclass of: Restriction
  all values from: RS METEOSAT
  on property: made by sensor
subclass of: Restriction
  has value: Atmosphere of Earth
  on property: has feature of interest
subclass of: Restriction
  has value: PWC
  on property: observed property
subclass of: Restriction
  on class: PWC Result
  qualified cardinality: 1
  on property: has result
comment: Class that represents observations related to precipitable_water_content . Unit of measure Millimetre (mm)..
comment: Sensor that takes PWC measurements from METEOSAT.

PWC Result
type: Class
subclass of: Result
subclass of: Restriction
  has value: Millimeter
  on property: unit
subclass of: Restriction
  some values from: double
  on property: numeric value
comment: Result that is normally obtained by PWC_METEOSAT sensors. Precipitable Water Content Result. Unit of measure Millimetre (mm).

Precipitation AEMET Observation
type: Class
subclass of: Ground based Observation
subclass of: Restriction
  all values from: Pluviometer
  on property: made by sensor
subclass of: Restriction
  has value: Atmosphere of Earth
  on property: has feature of interest
subclass of: Restriction
  has value: precipitation amount
  on property: observed property
subclass of: Restriction
  on class: Precipitation AEMET Result
  qualified cardinality: 1
  on property: has result
comment: Class that represents observations related to precipitation (mm).

Precipitation AEMET Result
type: Class
subclass of: Result
subclass of: Restriction
  has value: Millimeter
  on property: unit
subclass of: Restriction
  some values from: double
  on property: numeric value
comment: Result that is normally obtained by Pluviometer_AEMET sensors in AEMET Staion. Unit of measure Millimetre (mm).

RAD_Station
type: Class
subclass of: Ground Station
subclass of: Restriction
  all values from: Class
    union of: I dif g
    union of: I dir g
    union of: LW down g
    union of: LW up g
    union of: RN g
    union of: SW down g
    union of: SW up g
    union of: SurfaceAlbedo_g
  on property: hosts
comment: Class that represents solar radiation stations

RN g
type: Class
subclass of: Ground Based Sensing
subclass of: Restriction
  all values from: RAD_Station
  on property: is hosted by
subclass of: Restriction
  has value: surface net radiation
  on property: observes
comment: Sensor that takes "surface net radiation" measurements in RAD Station

RS Landsat-8
type: Class
subclass of: Remote Sensing Satellites
subclass of: Restriction
  all values from: Landsat-8
  on property: is hosted by
subclass of: Restriction
  has value: Chl
  on property: observes
subclass of: Restriction
  has value: EVI
  on property: observes
subclass of: Restriction
  has value: SAVI
  on property: observes
subclass of: Restriction
  has value: FAPAR
  on property: observes
subclass of: Restriction
  has value: LAI
  on property: observes
subclass of: Restriction
  has value: NDVI
  on property: observes
subclass of: Restriction
  has value: LST
  on property: observes
subclass of: Restriction
  has value: SR
  on property: observes
comment: Represents the general sensorization of satellite Landsat-8. Observes Chl, EVI, FAPAR, LAI, LST, NDVI, ,SAVI, SR, TDVI ...

RS Landsat-9
type: Class
subclass of: Remote Sensing Satellites
subclass of: Restriction
  all values from: Landsat-9
  on property: is hosted by
subclass of: Restriction
  has value: Chl
  on property: observes
subclass of: Restriction
  has value: EVI
  on property: observes
subclass of: Restriction
  has value: SAVI
  on property: observes
subclass of: Restriction
  has value: FAPAR
  on property: observes
subclass of: Restriction
  has value: LAI
  on property: observes
subclass of: Restriction
  has value: NDVI
  on property: observes
subclass of: Restriction
  has value: LST
  on property: observes
subclass of: Restriction
  has value: SR
  on property: observes
comment: Represents the general sensorization of satellite Lansat-9.Observes Chl, EVI, FAPAR, LAI, LST, NDVI, ,SAVI, SR, TDVI ...

RS METEOSAT
type: Class
subclass of: Remote Sensing Satellites
subclass of: Restriction
  all values from: METEOSAT
  on property: is hosted by
subclass of: Restriction
  has value: cloud mask
  on property: observes
subclass of: Restriction
  has value: cloud type
  on property: observes
subclass of: Restriction
  has value: PWC
  on property: observes
comment: Represents the general sensorization of satellite METEOSAT. Observes CloudMask, CloudType and PWC.

RS MODIS-Aqua
type: Class
subclass of: Remote Sensing Satellites
subclass of: Restriction
  all values from: MODIS-Aqua
  on property: is hosted by
subclass of: Restriction
  has value: EVI
  on property: observes
subclass of: Restriction
  has value: FAPAR
  on property: observes
subclass of: Restriction
  has value: NDVI
  on property: observes
subclass of: Restriction
  has value: LST
  on property: observes
comment: Represents the general sensorization of satellite MODIS-Aqua. Observes EVI , FAPAR, LST, NDVI, ...

RS MODIS-Terra
type: Class
subclass of: Remote Sensing Satellites
subclass of: Restriction
  all values from: MODIS-Terra
  on property: is hosted by
subclass of: Restriction
  has value: EVI
  on property: observes
subclass of: Restriction
  has value: FAPAR
  on property: observes
subclass of: Restriction
  has value: NDVI
  on property: observes
subclass of: Restriction
  has value: LST
  on property: observes
comment: Represents the general sensorization of satellite MODIS-Terra. Observes EVI , FAPAR, LST, NDVI, ...

RS SMAP
type: Class
subclass of: Remote Sensing Satellites
subclass of: Restriction
  all values from: SMAP
  on property: is hosted by
subclass of: Restriction
  has value: SM
  on property: observes
comment: Represents the general sensorization of SMAP. Observes Soil Moisture.

RS SMOS
type: Class
subclass of: Remote Sensing Satellites
subclass of: Restriction
  all values from: SMOS
  on property: is hosted by
subclass of: Restriction
  has value: AGB
  on property: observes
subclass of: Restriction
  has value: Surface_roughness
  on property: observes
subclass of: Restriction
  has value: Drought
  on property: observes
subclass of: Restriction
  has value: SM
  on property: observes
comment: Represents the general sensorization of satellite SMOS. Observes AGB, DroughtIndex, Soil Moisture.

RS Sentinel-1
type: Class
subclass of: Remote Sensing Satellites
subclass of: Restriction
  all values from: Sentinel-1
  on property: is hosted by
subclass of: Restriction
  has value: SM
  on property: observes
comment: Represents the general sensorization of satellite Sentinel 1 or S1. Observes Soil Moisture.

RS Sentinel-2
type: Class
subclass of: Remote Sensing Satellites
subclass of: Restriction
  all values from: Sentinel-2
  on property: is hosted by
subclass of: Restriction
  has value: Chl
  on property: observes
subclass of: Restriction
  has value: EVI
  on property: observes
subclass of: Restriction
  has value: SAVI
  on property: observes
subclass of: Restriction
  has value: FAPAR
  on property: observes
subclass of: Restriction
  has value: Landcover
  on property: observes
subclass of: Restriction
  has value: LAI
  on property: observes
subclass of: Restriction
  has value: NDVI
  on property: observes
subclass of: Restriction
  has value: SR
  on property: observes
comment: Represents the general sensorization of satellite Sentinel 2 or S2. Observes Chl, EVI, FAPAR, LAI, LandCover, NDVI, SAVI, SR ...

RS Sentinel-3 OLCI
type: Class
subclass of: Remote Sensing Satellites
subclass of: Restriction
  all values from: Sentinel-3_OLCI
  on property: is hosted by
subclass of: Restriction
  has value: Chl
  on property: observes
subclass of: Restriction
  has value: FAPAR
  on property: observes
comment: Represents the general sensorization of satellite Sentinel 3 ( S3) OLCI. Observes FAPAR , Chl.

RS Sentinel-3 SLSTR
type: Class
subclass of: Remote Sensing Satellites
subclass of: Restriction
  all values from: Sentinel-3_SLSTR
  on property: is hosted by
subclass of: Restriction
  has value: LST
  on property: observes
comment: Represents the general sensorization of satellite Sentinel 3 ( S3) SLSTR. Observes LST.

RS UAV Hyperspectral
type: Class
subclass of: Remote Sensing UAVs
subclass of: Restriction
  all values from: UAV_Hyperspectral
  on property: is hosted by
subclass of: Restriction
  has value: CRI
  on property: observes
subclass of: Restriction
  has value: AGB
  on property: observes
subclass of: Restriction
  has value: DiseaseStatus
  on property: observes
subclass of: Restriction
  has value: NRI
  on property: observes
subclass of: Restriction
  has value: NDWI
  on property: observes
comment: Represents the general sensorization of RS_UAV_Hyperspectral. Observes NRI, CRI, NDWI, AGB. DiseaseStatus.

RS UAV LiDAR
type: Class
subclass of: Remote Sensing UAVs
subclass of: Restriction
  all values from: UAV_LiDAR
  on property: is hosted by
subclass of: Restriction
  has value: AGB
  on property: observes
subclass of: Restriction
  has value: DBH
  on property: observes
subclass of: Restriction
  has value: CHM
  on property: observes
subclass of: Restriction
  has value: DSM
  on property: observes
subclass of: Restriction
  has value: DTM
  on property: observes
comment: Represents the general sensorization of RS_UAV_LiDAR. Observes CHM, DTM, DSM. DBH, AGB.

RS UAV Microwave
type: Class
subclass of: Remote Sensing UAVs
subclass of: Restriction
  all values from: UAV_Microwave
  on property: is hosted by
subclass of: Restriction
  has value: SM
  on property: observes
comment: Represents the general sensorization of RS_UAV_Microwave. Observes SM.

RS UAV Multispectral
type: Class
subclass of: Remote Sensing UAVs
subclass of: Restriction
  all values from: UAV_Multispectral
  on property: is hosted by
subclass of: Restriction
  has value: EVI
  on property: observes
subclass of: Restriction
  has value: SAVI
  on property: observes
subclass of: Restriction
  has value: FAPAR
  on property: observes
subclass of: Restriction
  has value: LAI
  on property: observes
subclass of: Restriction
  has value: NDVI
  on property: observes
subclass of: Restriction
  has value: SR
  on property: observes
comment: Represents the general sensorization of RS_UAV_Multispectral. Observes EVI, FAPAR, LAI, NDVI, ,SAVI y SR.

RS UAV RGB
type: Class
subclass of: Remote Sensing UAVs
subclass of: Restriction
  all values from: UAV_RGB
  on property: is hosted by
subclass of: Restriction
  has value: Orthophoto
  on property: observes
comment: Represents the general sensorization of RS_UAV_RGB. Observes ORTHOPHOTO

RS UAV Thermal
type: Class
subclass of: Remote Sensing UAVs
subclass of: Restriction
  all values from: UAV_Thermal
  on property: is hosted by
subclass of: Restriction
  has value: LST
  on property: observes
comment: Represents the general sensorization of RS_UAV_Thermal. Observes LST.

Radiation Property
type: Class
subclass of: Observable Property
comment: Class that represents all Radiation properties

Remote Sensing Satellites
type: Class
subclass of: Sensor
comment: Satellite Sensors (remote sensing).

Remote Sensing UAVs
type: Class
subclass of: Sensor
comment: Drone Sensors (remote sensing).

SAVI L8 Observation
type: Class
subclass of: SAVI Satellite Observation
subclass of: Restriction
  all values from: RS Landsat-8
  on property: made by sensor
comment: Class that represents observations related to Soil Adjusted Vegetation Index (SAVI).
comment: Sensor that takes SAVI measurements from Landsat-8.

SAVI L9 Observation
type: Class
subclass of: SAVI Satellite Observation
subclass of: Restriction
  all values from: RS Landsat-9
  on property: made by sensor
comment: Class that represents observations related to Soil Adjusted Vegetation Index (SAVI).
comment: Sensor that takes SAVI measurements from Landsat-9.

SAVI Result
type: Class
subclass of: Result
subclass of: Restriction
  has value: Number
  on property: unit
subclass of: Restriction
  some values from: double
  on property: numeric value
comment: Result that is normally obtained by Soil Adjusted Vegetation Index (SAVI) sensors. Dimensionless.

SAVI S2 Observation
type: Class
subclass of: SAVI Satellite Observation
subclass of: Restriction
  all values from: RS Sentinel-2
  on property: made by sensor
comment: Class that represents observations related to Soil Adjusted Vegetation Index (SAVI).
comment: Sensor that takes SAVI measurements from Sentinel-2.

SAVI Satellite Observation
type: Class
subclass of: Satellite Observation
subclass of: Restriction
  has value: Vegetation
  on property: has feature of interest
subclass of: Restriction
  has value: SAVI
  on property: observed property
subclass of: Restriction
  on class: SAVI Result
  qualified cardinality: 1
  on property: has result
comment: Class that represents observations related to Soil Adjusted Vegetation Index (SAVI). Dimensionless.

SAVI UAV Observation
type: Class
subclass of: UAV Observation
subclass of: Restriction
  all values from: RS UAV Multispectral
  on property: made by sensor
subclass of: Restriction
  has value: Vegetation
  on property: has feature of interest
subclass of: Restriction
  has value: SAVI
  on property: observed property
subclass of: Restriction
  on class: SAVI Result
  qualified cardinality: 1
  on property: has result
comment: Class that represents observations related to Soil Adjusted Vegetation Index (SAVI). Dimensionless.

SMAP
type: Class
subclass of: Satellite

SMAP_Product
type: Class
subclass of: Satellite Product
comment: Class that represents SMAP satellite Products

SMOS
type: Class
subclass of: Satellite

SMOS_Product
type: Class
subclass of: Satellite Product
comment: Class that represents SMOS satellite Products

SM Observation
type: Class
subclass of: Ground based Observation
subclass of: Restriction
  all values from: SM g
  on property: made by sensor
subclass of: Restriction
  has value: Soil
  on property: has feature of interest
subclass of: Restriction
  has value: SM
  on property: observed property
subclass of: Restriction
  on class: SM Result
  qualified cardinality: 1
  on property: has result
comment: Class that represents observations related to Soil Moisture (SM). Unit of measure Cubic Metre per Cubic Metre.

SM Result
type: Class
subclass of: Result
subclass of: Restriction
  has value: Cubic Meter Per Cubic Meter
  on property: unit
subclass of: Restriction
  some values from: double
  on property: numeric value
comment: Result that is normally obtained by SM (Soil Moisture) sensors. Unit of measure Cubic Metre per Cubic Metre.

SM S1 Observation
type: Class
subclass of: SM Satellite Observation
subclass of: Restriction
  all values from: RS Sentinel-1
  on property: made by sensor
comment: Class that represents observations related to Soil Moisture (SM). Dimensionless [0-1]
comment: Sensor that takes SM measurements from S1.

SM SMAP 36km Observation
type: Class
subclass of: SM Satellite Observation
subclass of: Restriction
  all values from: RS SMAP
  on property: made by sensor
comment: Class that represents observations related to Soil Moisture (SM). Dimensionless [0-1]
comment: Daily temporality, 36 km resolution
comment: Soil Moisture Sensor. Resolution of 36 km for Europe from SMAP.

SM SMAP S1 3km Observation
type: Class
subclass of: SM Satellite Observation
subclass of: Restriction
  all values from: RS SMAP
  on property: made by sensor
comment: Class that represents observations related to Soil Moisture (SM). Dimensionless [0-1]
comment: Daily temporality, 3 km resolution
comment: Soil Moisture Sensor. Resolution of 3 km for Europe from SMAP.

SM SMAP S1 9km Observation
type: Class
subclass of: SM Satellite Observation
subclass of: Restriction
  all values from: RS SMAP
  on property: made by sensor
comment: Class that represents observations related to Soil Moisture (SM). Dimensionless [0-1]
comment: Daily temporality, 9 km resolution
comment: Soil Moisture Sensor. Resolution of 9 km for Europe from SMAP.

SM SMOS ESA Observation
type: Class
subclass of: SM Satellite Observation
subclass of: Restriction
  all values from: RS SMOS
  on property: made by sensor
comment: Class that represents observations related to Soil Moisture (SM). Dimensionless [0-1]
comment: Daily temporality, resolution 25 km
comment: Soil Moisture Sensor. Resolution of 25 km for Europe from SMOS.

SM Satellite Observation
type: Class
subclass of: Satellite Observation
subclass of: Restriction
  has value: Soil
  on property: has feature of interest
subclass of: Restriction
  has value: SM
  on property: observed property
subclass of: Restriction
  on class: SM Result
  qualified cardinality: 1
  on property: has result
comment: Class that represents observations related to Soil Moisture (SM). Unit of measure Cubic Metre per Cubic Metre.

SM_Station
type: Class
subclass of: Ground Station
subclass of: Restriction
  all values from: SM g
  on property: hosts
comment: Class that represents Soil Moisture stations

SM UAV Observation
type: Class
subclass of: UAV Observation
subclass of: Restriction
  all values from: RS UAV Microwave
  on property: made by sensor
subclass of: Restriction
  has value: Soil
  on property: has feature of interest
subclass of: Restriction
  has value: SM
  on property: observed property
subclass of: Restriction
  on class: SM Result
  qualified cardinality: 1
  on property: has result
comment: Class that represents observations related to Soil Moisture (SM). Unit of measure cubic metre per cubic metre.

SM g
type: Class
subclass of: Ground Based Sensing
subclass of: Restriction
  all values from: SM_Station
  on property: is hosted by
subclass of: Restriction
  has value: SM
  on property: observes
comment: Sensor that takes Soil Moisture measurements

SR L8 Observation
type: Class
subclass of: SR Satellite Observation
subclass of: Restriction
  all values from: RS Landsat-8
  on property: made by sensor
comment: Class that represents observations related to Simple Ratio (SR). Dimensionless.
comment: Sensor that takes SR measurements from L8.

SR L9 Observation
type: Class
subclass of: SR Satellite Observation
subclass of: Restriction
  all values from: RS Landsat-9
  on property: made by sensor
comment: Class that represents observations related to Simple Ratio (SR). Dimensionless.
comment: Sensor that takes SR measurements from L9.

SR Result
type: Class
subclass of: Result
subclass of: Restriction
  has value: Number
  on property: unit
subclass of: Restriction
  some values from: double
  on property: numeric value
comment: Result that is normally obtained by Simple Ratio (SR) sensors. Dimensionless.

SR S2 Observation
type: Class
subclass of: SR Satellite Observation
subclass of: Restriction
  all values from: RS Sentinel-2
  on property: made by sensor
comment: Class that represents observations related to Simple Ratio (SR). Dimensionless.
comment: Sensor that takes SR measurements from S2.

SR Satellite Observation
type: Class
subclass of: Satellite Observation
subclass of: Restriction
  has value: Vegetation
  on property: has feature of interest
subclass of: Restriction
  has value: SR
  on property: observed property
subclass of: Restriction
  on class: SR Result
  qualified cardinality: 1
  on property: has result
comment: Class that represents observations related to Simple Ratio (SR). Dimensionless.

SR UAV Observation
type: Class
subclass of: UAV Observation
subclass of: Restriction
  all values from: RS UAV Multispectral
  on property: made by sensor
subclass of: Restriction
  has value: Vegetation
  on property: has feature of interest
subclass of: Restriction
  has value: SR
  on property: observed property
subclass of: Restriction
  on class: SR Result
  qualified cardinality: 1
  on property: has result
comment: Class that represents observations related to Simple Ratio (SR). Dimensionless.

SW down g
type: Class
subclass of: Ground Based Sensing
subclass of: Restriction
  all values from: RAD_Station
  on property: is hosted by
subclass of: Restriction
  has value: surface downwelling shortwave flux in air
  on property: observes
comment: Sensor that takes "surface downwelling shortwave flux in air" measurements in RAD Station

SW up g
type: Class
subclass of: Ground Based Sensing
subclass of: Restriction
  all values from: RAD_Station
  on property: is hosted by
subclass of: Restriction
  has value: upwelling shortwave flux in air
  on property: observes
comment: Sensor that takes "upwelling shortwave flux in air" measurements in RAD Station

Satellite
type: Class
subclass of: Platform

Satellite Observation
type: Class
subclass of: Observation
subclass of: Restriction
  on class: Image Result
  qualified cardinality: 1
  on property: has result
comment: Observation collected by satellite.

Satellite Product
type: Class
equivalent class: Class
  intersection of: Restriction
    some values from: Satellite
    on property: hasSatelliteSource
  intersection of: Restriction
    all values from: Satellite
    on property: hasSatelliteSource
equivalent class: Class
  intersection of: Restriction
    some values from: dateTime
    on property: result time
  intersection of: Restriction
    all values from: dateTime
    on property: result time
subclass of: Feature
subclass of: Restriction
  some values from: Control Area
  on property: controlArea
comment: A Satellite Product is a processed dataset generated from raw satellite measurements, typically including radiometric, geometric, and atmospheric corrections. These products provide georeferenced environmental variables (e.g., reflectance, vegetation indices, land surface temperature, soil moisture) at defined spatial, temporal, and spectral resolutions, and serve as inputs for environmental monitoring, modelling, and validation workflows.
example: Examples include NDVI, FAPAR, LST, or surface reflectance products obtained from Sentinel-2, Sentinel-3, Landsat, or other EO missions.

Sensible Heat Flux Observation
type: Class
subclass of: Ground based Observation
subclass of: Class
  union of: Restriction
    has value: Atmosphere of Earth
    on property: has feature of interest
  union of: Restriction
    has value: Soil
    on property: has feature of interest
  union of: Restriction
    has value: Vegetation
    on property: has feature of interest
subclass of: Restriction
  all values from: Hs g
  on property: made by sensor
subclass of: Restriction
  has value: sensible_heat_flux
  on property: observed property
subclass of: Restriction
  on class: Sensible Heat Flux Result
  qualified cardinality: 1
  on property: has result
comment: Class that represents observations related to Sensible heat flux (W/m2).

Sensible Heat Flux Result
type: Class
subclass of: Result
subclass of: Restriction
  has value: Watt per Square Meter
  on property: unit
subclass of: Restriction
  some values from: double
  on property: numeric value
comment: Result that is normally obtained by Hs (sensible heat flux) sensors. Unit of measure Watt per Square Metre (W/m2).

Sentinel-1
type: Class
subclass of: Satellite

Sentinel-1_Product
type: Class
subclass of: Satellite Product
comment: Class that represents Sentinel-1 satellite Products

Sentinel-2
type: Class
subclass of: Satellite

Sentinel-2_Product
type: Class
subclass of: Satellite Product
comment: Class that represents Sentinel-2 satellite Products

Sentinel-3_OLCI
type: Class
subclass of: Satellite

Sentinel-3_OLCI_Product
type: Class
subclass of: Sentinel-3_Product
comment: Class that represents Sentinel-3 OLCI satellite Products

Sentinel-3_Product
type: Class
subclass of: Satellite Product
comment: Class that represents Sentinel-3 satellite Products

Sentinel-3_SLSTR
type: Class
subclass of: Satellite

Sentinel-3_SLSTR_Product
type: Class
subclass of: Sentinel-3_Product
comment: Class that represents Sentinel-3 SLSTR satellite Products

Snapshot
type: Class
equivalent class: Class
  intersection of: Class
    intersection of: Restriction
      some values from: Control Area
      on property: controlArea
    intersection of: Restriction
      all values from: Control Area
      on property: controlArea
  intersection of: Class
    intersection of: Restriction
      some values from: Satellite Product
      on property: has product
    intersection of: Restriction
      all values from: Satellite Product
      on property: has product

Soil Result
type: Class
subclass of: Result
subclass of: Restriction
  has value: Number
  on property: unit
subclass of: Restriction
  some values from: double
  on property: numeric value
comment: Result that is normally obtained by Land Cover sensors. Dimensionless.

Surface Albedo Observation
type: Class
subclass of: Ground based Observation
subclass of: Restriction
  all values from: SurfaceAlbedo_g
  on property: made by sensor
subclass of: Restriction
  has value: Radiation
  on property: has feature of interest
subclass of: Restriction
  has value: soil albedo
  on property: observed property
subclass of: Restriction
  on class: Surface Albedo Result
  qualified cardinality: 1
  on property: has result
comment: Class that represents observations related to Surface albedo (dimensionless)

Surface Albedo Result
type: Class
subclass of: Result
subclass of: Restriction
  has value: Number
  on property: unit
subclass of: Restriction
  some values from: double
  on property: numeric value
comment: Result that is normally obtained by SurfaceAlbedo sensors. Dimensionless.

Surface Downwelling Longwave Flux In Air Observation
type: Class
subclass of: Ground based Observation
subclass of: Restriction
  all values from: LW down g
  on property: made by sensor
subclass of: Restriction
  has value: Radiation
  on property: has feature of interest
subclass of: Restriction
  has value: surface downwelling longwave flux in air
  on property: observed property
subclass of: Restriction
  on class: Surface Downwelling Longwave Flux In Air Result
  qualified cardinality: 1
  on property: has result
comment: Class that represents observations related to Surface Downwelling Longwave Flux In Air (W/m2).

Surface Downwelling Longwave Flux In Air Result
type: Class
subclass of: Result
subclass of: Restriction
  has value: Watt per Square Meter
  on property: unit
subclass of: Restriction
  some values from: double
  on property: numeric value
comment: Result that is normally obtained by LW_down sensors. Unit of measure Watt per Square Metre (W/m2).

Surface Downwelling Shortwave Flux In Air Observation
type: Class
subclass of: Ground based Observation
subclass of: Restriction
  all values from: SW down g
  on property: made by sensor
subclass of: Restriction
  has value: Radiation
  on property: has feature of interest
subclass of: Restriction
  has value: surface downwelling shortwave flux in air
  on property: observed property
subclass of: Restriction
  on class: Surface Downwelling Shortwave Flux In Air Result
  qualified cardinality: 1
  on property: has result
comment: Class that represents observations related to Surface Downwelling Shortwave Flux In Air (W/m2)

Surface Downwelling Shortwave Flux In Air Result
type: Class
subclass of: Result
subclass of: Restriction
  has value: Watt per Square Meter
  on property: unit
subclass of: Restriction
  some values from: double
  on property: numeric value
comment: Result that is normally obtained by SW_down sensors. Unit of measure Watt per Square Metre (W/m2).

Surface Net Radiation Observation
type: Class
subclass of: Ground based Observation
subclass of: Restriction
  all values from: RN g
  on property: made by sensor
subclass of: Restriction
  has value: Radiation
  on property: has feature of interest
subclass of: Restriction
  has value: surface net radiation
  on property: observed property
subclass of: Restriction
  on class: Surface Net Radiation Result
  qualified cardinality: 1
  on property: has result
comment: Class that represents observations related to Surface net radiation (W/m2)

Surface Net Radiation Result
type: Class
subclass of: Result
subclass of: Restriction
  has value: Watt per Square Meter
  on property: unit
subclass of: Restriction
  some values from: double
  on property: numeric value
comment: Result that is normally obtained by RN sensors. Unit of measure Watt per Square Metre (W/m2).

Temperature AEMET Observation
type: Class
subclass of: Temperature Observation
subclass of: Restriction
  all values from: Thermometer_AEMET
  on property: made by sensor
comment: Class that represents observations related to temperature in AEMET Station. Celsius Degree.

Temperature EddyCovariance Observation
type: Class
subclass of: Temperature Observation
subclass of: Restriction
  all values from: Thermometer EddyCovariance
  on property: made by sensor
subclass of: Restriction
  has value: air temperature
  on property: observed property
comment: Class that represents observations related to temperature in EddyCovariance Station. Celsius Degree.

Temperature Observation
type: Class
subclass of: Ground based Observation
subclass of: Restriction
  on class: Temperature Result
  qualified cardinality: 1
  on property: has result
comment: Class that represents observations related to temperature. Celsius Degree.

Temperature Result
type: Class
subclass of: Result
subclass of: Restriction
  has value: Degree Celsius
  on property: unit
subclass of: Restriction
  some values from: double
  on property: numeric value
comment: Result that is normally obtained by Termometer sensors. Unit of measure Degree Celsius.

Temperature in air AEMET Observation
type: Class
subclass of: Temperature AEMET Observation
subclass of: Restriction
  has value: Air
  on property: has feature of interest
subclass of: Restriction
  has value: air temperature
  on property: observed property
definition: Observation of Air Temperature. Air Temperature is a measure of the hotness or coldness of the air. It is also termed surface temperature in meteorology. Air temperature is the temperature indicated by a thermometer exposed to the air but sheltered from direct sun exposure.

Temperature in ground AEMET Observation
type: Class
subclass of: Temperature AEMET Observation
subclass of: Restriction
  has value: Soil
  on property: has feature of interest
definition: Observation of the temperature at any given depth (or in a layer) below the surface of the ground, excluding surficial snow and ice (but not permafrost or soil). For temperatures in surface lying snow and ice, the more specific standard names temperature_in_surface_snow and land_ice_temperature should be used. For temperatures measured or modelled specifically for the soil layer (the near-surface layer where plants sink their roots) the standard name soil_temperature should be used.

Temperature in ground depth 05 AEMET Observation
type: Class
subclass of: Temperature in ground AEMET Observation
subclass of: Restriction
  has value: temperature in ground depth 05
  on property: observed property
definition: Observation of the Subsoil temperature at a depth of 5 cm and corresponding to the 10 minutes prior to the date given by 'fint' (degrees Celsius)

Temperature in ground depth 20 AEMET Observation
type: Class
subclass of: Temperature in ground AEMET Observation
subclass of: Restriction
  has value: temperature in ground depth 20
  on property: observed property
definition: Observation of the Subsoil temperature at a depth of 20 cm and corresponding to the 10 minutes prior to the date given by 'fint' (degrees Celsius)

Temperature in ground next ground AEMET Observation
type: Class
subclass of: Temperature in ground AEMET Observation
subclass of: Restriction
  has value: temperature in ground next ground
  on property: observed property
definition: Observation of the Ground temperature, instantaneous temperature next to the ground and corresponding to the 10 minutes prior to the date given by 'fint' (degrees Celsius)

Thermometer
type: Class
subclass of: Ground Based Sensing
subclass of: Restriction
  has value: air temperature
  on property: observes
comment: Measures temperature in degrees Celsius

Thermometer EddyCovariance
type: Class
subclass of: Thermometer
subclass of: Restriction
  all values from: EddyCovariance_Station
  on property: is hosted by
comment: Sensor belongs to EddyCovariance Station. Measures temperature in degrees Celsius

UAV
type: Class
subclass of: Platform
subclass of: Restriction
  on class: Control Area
  qualified cardinality: 1
  on property: controlArea
subclass of: Restriction
  on class: Land Cover Classes
  qualified cardinality: 1
  on property: hasTypeOfCover
comment: Unmanned aerial vehicle

UAV_Hyperspectral
type: Class
subclass of: UAV
subclass of: Restriction
  all values from: RS UAV Hyperspectral
  on property: hosts
comment: Unmanned aerial vehicle Hyperspectral

UAV_LiDAR
type: Class
subclass of: UAV
subclass of: Restriction
  all values from: RS UAV LiDAR
  on property: hosts
comment: Unmanned aerial vehicle LiDAR

UAV_Microwave
type: Class
subclass of: UAV
subclass of: Restriction
  all values from: RS UAV Microwave
  on property: hosts
comment: Unmanned aerial vehicle Microwave

UAV_Multispectral
type: Class
subclass of: UAV
subclass of: Restriction
  all values from: RS UAV Multispectral
  on property: hosts
comment: Unmanned aerial vehicle Multispectral

UAV Observation
type: Class
subclass of: Observation
comment: Observation collected by dron engine.

UAV_RGB
type: Class
subclass of: UAV
subclass of: Restriction
  all values from: RS UAV RGB
  on property: hosts
comment: Unmanned aerial vehicle RGB

UAV_Thermal
type: Class
subclass of: UAV
subclass of: Restriction
  all values from: RS UAV Thermal
  on property: hosts
comment: Unmanned aerial vehicle Thermal

Upwelling Longwave Flux In Air Observation
type: Class
subclass of: Ground based Observation
subclass of: Restriction
  all values from: LW up g
  on property: made by sensor
subclass of: Restriction
  has value: Radiation
  on property: has feature of interest
subclass of: Restriction
  has value: upwelling longwave flux in air
  on property: observed property
subclass of: Restriction
  on class: Upwelling Longwave Flux In Air Result
  qualified cardinality: 1
  on property: has result
comment: Class that represents observations related to Upwelling Longwave Flux In Air (W/m2)

Upwelling Longwave Flux In Air Result
type: Class
subclass of: Result
subclass of: Restriction
  has value: Watt per Square Meter
  on property: unit
subclass of: Restriction
  some values from: double
  on property: numeric value
comment: Result that is normally obtained by LW_up sensors. Unit of measure Watt per Square Metre (W/m2).

Upwelling Shortwave Flux In Air Observation
type: Class
subclass of: Ground based Observation
subclass of: Restriction
  all values from: SW up g
  on property: made by sensor
subclass of: Restriction
  has value: Radiation
  on property: has feature of interest
subclass of: Restriction
  has value: upwelling shortwave flux in air
  on property: observed property
subclass of: Restriction
  on class: Upwelling Shortwave Flux In Air Result
  qualified cardinality: 1
  on property: has result
comment: Class that represents observations related to Upwelling Shortwave Flux In Air (W/m2)

Upwelling Shortwave Flux In Air Result
type: Class
subclass of: Result
subclass of: Restriction
  has value: Watt per Square Meter
  on property: unit
subclass of: Restriction
  some values from: double
  on property: numeric value
comment: Result that is normally obtained by SW_up sensors. Unit of measure Watt per Square Metre (W/m2).

Vegetation Property
type: Class
subclass of: Observable Property
comment: Class that represents all Vegetation properties

Vegetation Result
type: Class
subclass of: Result
subclass of: Restriction
  has value: Number
  on property: unit
subclass of: Restriction
  some values from: double
  on property: numeric value
comment: Result that is normally obtained by Vegetation ( EVI. SAVI, TDVI ...) sensors. Dimensionless.

WaterVapourFlux g
type: Class
subclass of: Ground Based Sensing
subclass of: Restriction
  all values from: EddyCovariance_Station
  on property: is hosted by
subclass of: Restriction
  has value: surface water evaporation flux
  on property: observes
comment: Sensor that takes water flow measurements

Water Vapour Flux Observation
type: Class
subclass of: Ground based Observation
subclass of: Class
  union of: Restriction
    has value: Atmosphere of Earth
    on property: has feature of interest
  union of: Restriction
    has value: Soil
    on property: has feature of interest
  union of: Restriction
    has value: Vegetation
    on property: has feature of interest
subclass of: Restriction
  all values from: WaterVapourFlux g
  on property: made by sensor
subclass of: Restriction
  has value: surface water evaporation flux
  on property: observed property
subclass of: Restriction
  on class: Water Vapour Flux Result
  qualified cardinality: 1
  on property: has result
comment: Class that represents observations related to water vapour flux (W/m2)

Water Vapour Flux Result
type: Class
subclass of: Result
subclass of: Restriction
  has value: Watt per Square Meter
  on property: unit
subclass of: Restriction
  some values from: double
  on property: numeric value
comment: Result that is normally obtained by WatervapourFlux (water vapour flux) sensors. Unit of measure Watt per Square Metre (W/m2).

WindVane_AEMET
type: Class
subclass of: WindVane
subclass of: Restriction
  all values from: AEMET_Station
  on property: is hosted by
comment: Sensor belongs to AEMET Station. Sensor that takes wind direction [0º-360º] measurements

WindVane_EddyCovariance
type: Class
subclass of: WindVane
subclass of: Restriction
  all values from: EddyCovariance_Station
  on property: is hosted by
comment: Sensor belongs to EddyCovariance Station. Sensor that takes wind direction [0º-360º] measurements.

Wind Direction AEMET Observation
type: Class
subclass of: Wind Direction Observation
subclass of: Restriction
  all values from: WindVane_AEMET
  on property: made by sensor
comment: Class that represents observations related to wind direction. Angle Degree.

Wind Direction EddyCovariance Observation
type: Class
subclass of: Wind Direction Observation
subclass of: Restriction
  all values from: WindVane_AEMET
  on property: made by sensor
comment: Class that represents observations related to wind direction. Angle Degree.

Wind Direction Observation
type: Class
subclass of: Ground based Observation
subclass of: Restriction
  has value: Air
  on property: has feature of interest
subclass of: Restriction
  has value: wind from direction
  on property: observed property
subclass of: Restriction
  on class: Wind Direction Result
  qualified cardinality: 1
  on property: has result
comment: Class that represents observations related to wind direction. Angle Degree.

Wind Direction Result
type: Class
subclass of: Result
subclass of: Restriction
  has value: Degree
  on property: unit
subclass of: Restriction
  some values from: nonNegativeInteger
  on property: numeric value
comment: Result that is normally obtained by WindVane sensors. Unit of measure Angle Degree.

Wind Speed AEMET Observation
type: Class
subclass of: Wind Speed Observation
subclass of: Restriction
  all values from: Anemometer_AEMET
  on property: made by sensor
comment: Class that represents observations related to wind speed in AEMET Station. (m/s)

Wind Speed EddyCovariance Observation
type: Class
subclass of: Wind Speed Observation
subclass of: Restriction
  all values from: Anemometer EddyCovariance
  on property: made by sensor
comment: Class that represents observations related to wind speed in EddyCovariance Station. (m/s)

Wind Speed Observation
type: Class
subclass of: Ground based Observation
subclass of: Restriction
  has value: Air
  on property: has feature of interest
subclass of: Restriction
  has value: wind speed
  on property: observed property
subclass of: Restriction
  on class: Wind Speed Result
  qualified cardinality: 1
  on property: has result
comment: Class that represents observations related to wind speed. (m/s)

Wind Speed Result
type: Class
subclass of: Result
subclass of: Restriction
  has value: Meter per Second
  on property: unit
subclass of: Restriction
  some values from: double
  on property: numeric value
comment: Result that is normally obtained by Anemometer sensors. Unit of measure Metre per Second (m/s).

SurfaceAlbedo_g
type: Class
subclass of: Ground Based Sensing
subclass of: Restriction
  all values from: RAD_Station
  on property: is hosted by
subclass of: Restriction
  has value: soil albedo
  on property: observes
comment: Sensor that takes "soil albedo" measurements in RAD Station

CRI
type: NamedIndividual
type: Vegetation Property
is observed by: CRI UAV Hyperspectral Sensor 1
comment: Carotenoid Reflectance Index 1 (CRI1) Carotenoids function in light absorption processes in plants, as well as in protecting plants from the harmful effects of too much light. Weakening vegetation contains higher concentrations of carotenoids, so this index is one measure of stressed vegetation. Higher CRI1 values mean greater carotenoid concentration relative to chlorophyll. The value of this index ranges from 0 to more than 15. The common range for green vegetation is 1 to 12. This index uses reflectance measurements in the visible spectrum to take advantage of the absorption signatures of stress-related pigments. See Narrowband Definitions for the allowable range of wavelengths.

AGB
type: NamedIndividual
type: Vegetation Property
is observed by: AGB SMOS CATDS Sensor 1
is observed by: AGB UAV Hyperspectral Sensor 1
is observed by: AGB UAV LiDAR Sensor 1
comment: Information All biomass of living vegetation, both woody and herbaceous, above the soil including stems, stumps, branches, bark, seeds, and foliage.
definition: Aboveground Biomass (AGB) is defined as the total amount of plant-derived living and dead organic matter per unit of surface area, which is an important component of terrestrial carbon cycle.

DBH
type: NamedIndividual
type: Vegetation Property
is observed by: DBH UAV LiDAR Sensor 1
comment: Diameter at Breast Height (DBH). Diameter is generally measured 1.3 m. (4.5 feet) above the ground, which is roughly at breast height. DBH is measured on standing trees outside of the bark.

Surface_roughness
type: NamedIndividual
type: Soil Property
is observed by: Roughness SMOS CATDS Sensor 1
description: Surface roughness refers to the measure of small, finely spaced deviations in the shape or texture of a surface
Source: http://codes.wmo.int/grib2/

Comunitat Valenciana
type: NamedIndividual
type: Autonomous Community

Valencia/València
type: NamedIndividual
type: Province
Source: http://datos.gob.es/recurso/sector-publico/territorio/Provincia/

Air
type: NamedIndividual
type: Feature Of Interest
description: The element of air, along with fire, earth, and water, is one of the four traditional elements in cosmogonies in both Western and Eastern traditions. It is present in all religions and their rituals, in esoteric philosophy, in alchemy, and in astrology. It is considered 'active and masculine,' just like the element of fire, in contrast to earth and water, which are considered 'passive and feminine.
comment: Air

Atmosphere of Earth
type: NamedIndividual
type: Feature Of Interest
description: The Earth's atmosphere is the gaseous part of the Earth, making it the outermost and least dense layer of the planet. It consists of various gases that vary in quantity depending on altitude. This mixture of gases that forms the atmosphere is commonly referred to as air. Approximately 75% of the atmospheric mass is located within the first 11 kilometers from the sea surface. The primary gases that make up the atmosphere are oxygen (21%) and nitrogen (78%), followed by argon, carbon dioxide, and water vapor.

Chl
type: NamedIndividual
type: Vegetation Property
is observed by: Chl L8 Sensor 1
is observed by: Chl L9 Sensor 1
is observed by: Chl S2 Sensor 1
is observed by: Chl g Sensor 1
is observed by: OTCI S3 Sensor 1
description: Chlorophylls (from the Greek words χλωρος, chloros, meaning 'green,' and φύλλον, fýlon, meaning 'leaf') are a family of green-colored pigments found in cyanobacteria and in all organisms that possess chloroplasts or thylakoid membranes in their cells, which includes plants and various types of algae. Chlorophyll is a highly essential biomolecule, critical in the process of photosynthesis, which enables plants and algae to store energy from sunlight.

diffuse_irradiance
type: NamedIndividual
type: Radiation Property
is observed by: I dif g RAD Sensor 1
comment: Diffuse irradiation is the one that reaches the earth's surface from the sky except for the sun due to the scattering and reflection by the compositions of the atmosphere.

direct_irradiance_at_the_surface
type: NamedIndividual
type: Radiation Property
is observed by: I dir g RAD Sensor 1
comment: Direct radiation is the solar radiation which travels on a straight line from the sun down to the earth׳s surface

Drought
type: NamedIndividual
type: Soil Property
is observed by: DroughtIndex SMOS CATDS Sensor 1
description: Drought is a transient climatological anomaly in which the availability of water falls below the usual levels in a geographical area. There is not enough water to meet the needs of plants, animals, and humans residing in that area. The primary cause of all droughts is a lack of rain or precipitation, known as meteorological drought. If it persists, it can lead to a condition characterized by an imbalance between the natural water supply and the natural water demand. In extreme cases, it can lead to aridity. @es

EVI
type: NamedIndividual
type: Vegetation Property
is observed by: EVI L8 Sensor 1
is observed by: EVI L9 Sensor 1
is observed by: EVI S2 Sensor 1
is observed by: EVI UAV Multispectral Sensor 1
is observed by: EVI diary 500m a Sensor 1
is observed by: EVI diary 500m t Sensor 1
comment: The enhanced vegetation index (EVI) is an 'optimized' vegetation index designed to enhance the vegetation signal with improved sensitivity in high biomass regions and improved vegetation monitoring through a de-coupling of the canopy background signal and a reduction in atmosphere influences. EVI is computed following this equation: where: * NIR/red/blue are atmospherically-corrected and partially atmosphere corrected (Rayleigh and ozone absorption) surface reflectances * L is the canopy background adjustment that addresses non-linear, differential NIR and red radiant transfer through a canopy, and * C1, C2 are the coefficients of the aerosol resistance term, which uses the blue band to correct for aerosol influences in the red band. The coefficients adopted in the MODIS-EVI algorithm are: L=1, C1 = 6, C2 = 7.5, and G (gain factor) = 2.5. Whereas the Normalized Difference Vegetation Index (NDVI) is chlorophyll sensitive, the EVI is more responsive to canopy structural variations, including leaf area index (LAI), canopy type, plant physiognomy, and canopy architecture. The two vegetation indices complement each other in global vegetation studies and improve upon the detection of vegetation changes and extraction of canopy biophysical parameters.. Another difference between Normalized Difference Vegetation Index (NDVI) and EVI is that in the presence of snow, NDVI decreases, while EVI increases (Huete, 2002). Starting 2000, and after the launch of the two MODIS sensors on Terra (satellite) and Aqua (satellite) by NASA, EVI was adopted as a standard product by NASA and became extremely popular with users due to its ability to eliminate background and atmosphere noises, as well as its non saturation, a typical NDVI problem. EVI is currently distributed for free by the USGS LP DAAC. (en)

Humidity
type: NamedIndividual
type: Meteorology Property
description: The humidity of the air is due to the water vapor present in the atmosphere. This vapor comes from the evaporation of terrestrial water bodies. The amount of water vapor that air can hold depends on its temperature. Warm air can hold more water vapor than cold air. One way to measure atmospheric humidity is through a hygrometer

Land surface
type: NamedIndividual
type: Feature Of Interest
description: Earth's relief refers to the term that defines the shapes and features of the Earth's crust or lithosphere on the surface, both concerning landforms on emerged lands and the oceanic relief, which pertains to the seafloor. It is the subject of study in geomorphology and physical geography, especially when referring to continental and island lands. Pierre George provides a simple definition of Earth's relief: The Earth's relief is the raised part of the globe's surface, such as hills or mountains.

Orthophoto
type: NamedIndividual
type: Soil Property
type: Vegetation Property
is observed by: Orthophoto UAV RGB Sensor 1
comment: geometrically corrected aerial photograph

DiseaseStatus
type: NamedIndividual
type: Vegetation Property
is observed by: DiseaseStatus UAV Hyperspectral Sensor 1
comment: Spectral indicator of plant disease or pathogen-induced stress.

Radiation
type: NamedIndividual
type: Feature Of Interest
description: The phenomenon of radiation is the propagation of energy in the form of electromagnetic waves or subatomic particles through a vacuum or a material medium. There are different forms of radiation with distinct properties and effects.

Soil
type: NamedIndividual
type: Feature Of Interest
description: The term 'soil' refers to the surface layer of the Earth's crust that is biologically active and originates from the physical or chemical disintegration or alteration of rocks, as well as from the residues of living organisms that settle upon it. Many processes can contribute to the formation of a specific type of soil, including aeolian deposition, sedimentation in watercourses, weathering, and the deposition of organic material

SAVI
type: NamedIndividual
type: Vegetation Property
is observed by: SAVI L8 Sensor 1
is observed by: SAVI L9 Sensor 1
is observed by: SAVI S2 Sensor 1
is observed by: SAVI UAV Multispectral Sensor 1
comment: Empirically derived NDVI products have been shown to be unstable, varying with soil colour, soil moisture, and saturation effects from high density vegetation. In an attempt to improve NDVI, Huete developed a vegetation index that accounted for the differential red and near-infrared extinction through the vegetation canopy. The index is a transformation technique that minimizes soil brightness influences from spectral vegetation indices involving red and near-infrared (NIR) wavelengths. The index is given as: where L is a canopy background adjustment factor. An L value of 0.5 in reflectance space was found to minimize soil brightness variations and eliminate the need for additional calibration for different soils.The transformation was found to nearly eliminate soil-induced variations in vegetation indices. (en)

SM
type: NamedIndividual
type: Soil Property
is observed by: SM NRT SMOS ESA Sensor 1
is observed by: SM S1 Sensor 1
is observed by: SM SMAP-S1 3km Sensor 1
is observed by: SM SMAP-S1 9km Sensor 1
is observed by: SM SMAP 36km Sensor 1
is observed by: SM SMOS-IC CATDS Sensor 1
is observed by: SM SMOS BEC Sensor 1
is observed by: SM SMOS ESA Sensor 1
is observed by: SM UAV Microwave Sensor 1
is observed by: SM freeze and Thaw SMOS ESA Sensor 1
is observed by: SM g Sensor 1
is observed by: SM g Sensor 2
is observed by: SM g Sensor 3
is observed by: SM g Sensor 4
is observed by: SM g Sensor 5
is observed by: SM g Sensor 6
comment: Soil moisture is the water content of the soil. It can be expressed in terms of volume or weight. Soil moisture measurement can be based on in situ probes (e.g., capacitance probes, neutron probes) or remote sensing methods. Water that enters a field is removed from a field by runoff, drainage, evaporation or transpiration.

Vegetation
type: NamedIndividual
type: Feature Of Interest
description: Vegetation refers to the coverage of wild or cultivated plants (flora) that grow spontaneously in a geographic area, whether on the land surface or in an aquatic environment. It is also referred to as vegetation cover. Its distribution on Earth depends on climatic factors and soils. Vegetation is so important that climate types are even categorized based on the type of vegetation that grows in the areas where they dominate. This is why we talk about a jungle climate, a savanna climate, a taiga climate, among other rainy climates, etc.

Length
type: NamedIndividual
comment: Length

SI
type: NamedIndividual
comment: System International of measures.

Centimetre
type: NamedIndividual
type: DerivedUnit
type: Unit
scaling of: Meter
conversion multiplier SN: 0.01
description: A centimetre is a unit of length in the metric system, equal to one hundredth of a metre, which is the SI base unit of length. Centi is the SI prefix for a factor of $10^{-2}$. The centimetre is the base unit of length in the now deprecated centimetre-gram-second (CGS) system of units.
applicable system: SI
conversion multiplier: 0.01
dbpedia match: http://dbpedia.org/resource/Centimetre
has quantity kind: Length
iec61360 code: 0112/2///62720#UAA375
informative reference: http://en.wikipedia.org/wiki/Centimetre
informative reference: https://cdd.iec.ch/cdd/iec62720/iec62720.nsf/Units/0112-2---62720%23UAA375
symbol: cm
ucum code: cm
unece common code: CMT
wikidata match: Q174728
comment: A centimetre is a unit of length in the metric system, equal to one hundredth of a metre, which is the SI base unit of length. Centi is the SI prefix for a factor of 10-2 . The centimetre is the base unit of length in the now deprecated centimetre-gram-second (CGS) system of units.
label: Centimeter
label: Centimetr @cs
label: Centimetro @it
label: Centimetru @ro
label: Centimètre @fr
label: Centiméter @hu

Degree
type: NamedIndividual
type: Unit
description: A degree (in full, a degree of arc, arc degree, or arcdegree), usually denoted by \(^\circ\) (the degree symbol), is a measurement of plane angle, representing 1/360 of a full rotation; one degree is equivalent to \(2\pi /360 rad\), \(0.017453 rad\). It is not an SI unit, as the SI unit for angles is radian, but is an accepted SI unit.
conversion multiplier: 0.0174532925
has dimension vector: A0E0L0I0M0H0T0D1
has quantity kind: Angle
iec61360 code: 0112/2///62720#UAA024
informative reference: http://www.oxfordreference.com/view/10.1093/acref/9780198605225.001.0001/acref-9780198605225-e-331
om unit: degree
symbol: °
ucum code: deg
udunits code: °
unece common code: DD

Degree Celsius
type: NamedIndividual
type: DerivedUnit
type: Unit
description: \(\textit{Celsius}\), also known as centigrade, is a scale and unit of measurement for temperature. It can refer to a specific temperature on the Celsius scale as well as a unit to indicate a temperature interval, a difference between two temperatures or an uncertainty. This definition fixes the magnitude of both the degree Celsius and the kelvin as precisely 1 part in 273.16 (approximately 0.00366) of the difference between absolute zero and the triple point of water. Thus, it sets the magnitude of one degree Celsius and that of one kelvin as exactly the same. Additionally, it establishes the difference between the two scales' null points as being precisely \(273.15\,^{\circ}{\rm C}\).
allowed unit of system: SI
conversion multiplier: 1.0
conversion offset: 273.15
dbpedia match: http://dbpedia.org/resource/Celsius
expression: \(degC\)
guidance: See NIST section SP811 section 4.2.1.1
guidance: See NIST section SP811 section 6.2.8
has dimension vector: A0E0L0I0M0H1T0D0
has quantity kind: BoilingPoint
has quantity kind: FlashPoint
has quantity kind: MeltingPoint
has quantity kind: Temperature
iec61360 code: 0112/2///62720#UAA033
informative reference: http://en.wikipedia.org/wiki/Celsius
latex definition: \(\,^{\circ}{\rm C}\)
om unit: degreeCelsius
symbol: °C
ucum code: Cel
udunits code: °C
udunits code: ℃
unece common code: CEL
alternative label: degree-centigrade

Gram Per Cubic Meter
type: NamedIndividual
type: Unit
conversion multiplier: 0.001
has dimension vector: A0E0L-3I0M1H0T0D0
has quantity kind: MassDensity
iec61360 code: 0112/2///62720#UAA487
plain text description: 0,001-fold of the SI base unit kilogram divided by the power of the SI base unit metre with the exponent 3
symbol: g/m³
ucum code: g.m-3
ucum code: g/m3
unece common code: A93
label: Gram Per Cubic Metre

Hour
type: NamedIndividual
type: Unit
description: The hour (common symbol: h or hr) is a unit of measurement of time. In modern usage, an hour comprises 60 minutes, or 3,600 seconds. It is approximately 1/24 of a mean solar day. An hour in the Universal Coordinated Time (UTC) time standard can include a negative or positive leap second, and may therefore have a duration of 3,599 or 3,601 seconds for adjustment purposes. Although it is not a standard defined by the International System of Units, the hour is a unit accepted for use with SI, represented by the symbol h.
applicable system: IMPERIAL
applicable system: SI
applicable system: USCS
conversion multiplier: 3600.0
dbpedia match: http://dbpedia.org/resource/Hour
defined unit of system: USCS
has dimension vector: A0E0L0I0M0H0T1D0
has quantity kind: Time
iec61360 code: 0112/2///62720#UAA525
informative reference: http://en.wikipedia.org/wiki/Hour
om unit: hour
symbol: hr
ucum code: h
udunits code: h
unece common code: HUR

Hectopascal
type: NamedIndividual
type: DerivedUnit
type: Unit
description: Hectopascal is a unit of pressure. 1 Pa is approximately the pressure exerted by a 10-g mass resting on a 1-cm2 area. 1013 hPa = 1 atm. There are 100 pascals in 1 hectopascal.
applicable system: SI
conversion multiplier: 100.0
exact match: MilliBAR
has dimension vector: A0E0L-1I0M1H0T-2D0
has quantity kind: ForcePerArea
has quantity kind: ModulusOfElasticity
has quantity kind: VaporPressure
iec61360 code: 0112/2///62720#UAA527
symbol: hPa
ucum code: hPa
unece common code: A97
comment: Hectopascal is commonly used in meteorology to report values for atmospheric pressure. It is equivalent to millibar.

Kilopascal
type: NamedIndividual
type: DerivedUnit
type: Unit
description: Kilopascal is a unit of pressure. 1 kPa is approximately the pressure exerted by a 10-g mass resting on a 1-cm2 area. 101.3 kPa = 1 atm. There are 1,000 pascals in 1 kilopascal.
allowed unit of system: SI
conversion multiplier: 1000.0
dbpedia match: http://dbpedia.org/resource/Pascal_%28unit%29
has dimension vector: A0E0L-1I0M1H0T-2D0
has quantity kind: ForcePerArea
has quantity kind: VaporPressure
iec61360 code: 0112/2///62720#UAA575
is scaling of: PA
symbol: kPa
ucum code: kPa
unece common code: KPA
unit of system: SI

Meter
type: NamedIndividual
type: Unit
description: The metric and SI base unit of distance. The 17th General Conference on Weights and Measures in 1983 defined the meter as that distance that makes the speed of light in a vacuum equal to exactly 299 792 458 meters per second. The speed of light in a vacuum, \(c\), is one of the fundamental constants of nature. The meter is equal to approximately 1.093 613 3 yards, 3.280 840 feet, or 39.370 079 inches.
conversion multiplier: 1.0
dbpedia match: http://dbpedia.org/resource/Metre
defined unit of system: SI
has quantity kind: Length
iec61360 code: 0112/2///62720#UAA726
informative reference: http://en.wikipedia.org/wiki/Metre
is unit of system: SI
om unit: metre
plain text description: The metric and SI base unit of distance. The meter is equal to approximately 1.093 613 3 yards, 3.280 840 feet, or 39.370 079 inches.
symbol: m
ucum code: m
udunits code: m
unece common code: MTR
label: Metre

Meter per Second
type: NamedIndividual
type: DerivedUnit
type: Unit
description: Metre per second is an SI derived unit of both speed (scalar) and velocity (vector quantity which specifies both magnitude and a specific direction), defined by distance in metres divided by time in seconds. The official SI symbolic abbreviation is mu00b7s-1, or equivalently either m/s.
conversion multiplier: 1.0
defined unit of system: SI
derived coherent unit of system: SI
expression: \(m/s\)
has dimension vector: A0E0L1I0M0H0T-1D0
has quantity kind: ElectromagneticWavePhaseSpeed
has quantity kind: Speed
has quantity kind: Velocity
iec61360 code: 0112/2///62720#UAA733
symbol: m/s
ucum code: m.s-1
ucum code: m/s
unece common code: MTS
label: Metre per Second

Cubic Meter Per Cubic Meter
type: NamedIndividual
type: Unit
conversion multiplier: 1.0
has dimension vector: A0E0L0I0M0H0T0D1
has quantity kind: VolumeFraction
iec61360 code: 0112/2///62720#UAA767
is unit of system: SI
plain text description: power of the SI base unit metre with the exponent 3 divided by the power of the SI base unit metre with the exponent 3
symbol: m³/m³
ucum code: m3.m-3
unece common code: H60
label: Cubic Metre Per Cubic Metre

Microgram per square centimetre
type: NamedIndividual
type: Unit
conversion multiplier: 0.01
conversion offset: 0.0
has dimension vector: A0E0L-2I0M1H0T0D0
has quantity kind: MassPerArea
plain text description: A unit of mass per area, equivalent to 0.01 grammes per square metre
symbol: µg/cm²

Micromoles per square metre
type: NamedIndividual
type: Unit
description: One part per 10**6 (million) of the SI unit of quantity of matter (the mole) per SI unit area.
conversion multiplier: 0.000001
has dimension vector: A1E0L-2I0M0H0T0D0
symbol: µmol/m²
ucum code: umol.m-2
ucum code: umol/m2

Milligram Per Gram
type: NamedIndividual
type: Unit
conversion multiplier: 0.001
has dimension vector: A0E0L0I0M0H0T0D1
has quantity kind: MassRatio
iec61360 code: 0112/2///62720#UAA822
is unit of system: SI
plain text description: 0.000001-fold of the SI base unit kilogram divided by the 0.001-fold of the SI base unit kilogram
qkdv denominator: A0E0L0I0M1H0T0D0
qkdv numerator: A0E0L0I0M1H0T0D0
symbol: mg/gm
ucum code: mg.g-1
ucum code: mg/g
unece common code: H64

Milligram Per Hectare
type: NamedIndividual
type: Unit
conversion multiplier: 0.0000000001
has dimension vector: A0E0L-2I0M1H0T0D0
has quantity kind: MassPerArea
iec61360 code: 0112/2///62720#UAA818
is unit of system: SI
plain text description: 0.000001-fold of the SI base unit kilogram divided by the 10,0000-fold of the power of the SI base unit metre with the exponent 2
ucum code: mg.har-1

Milligrams per square metre per second
type: NamedIndividual
type: Unit
conversion multiplier: 0.000001
has dimension vector: A0E0L-2I0M1H0T-1D0
has quantity kind: MassPerAreaTime
symbol: mg/(m²⋅s)
ucum code: mg.m-2.s-1

Millimeter
type: NamedIndividual
type: DerivedUnit
type: Unit
description: The millimetre (International spelling as used by the International Bureau of Weights and Measures) or millimeter (American spelling) (SI unit symbol mm) is a unit of length in the metric system, equal to one thousandth of a metre, which is the SI base unit of length. It is equal to 1000 micrometres or 1000000 nanometres. A millimetre is equal to exactly 5/127 (approximately 0.039370) of an inch.
applicable system: SI
conversion multiplier: 0.001
dbpedia match: http://dbpedia.org/resource/Millimetre
expression: \(mm\)
has quantity kind: Length
iec61360 code: 0112/2///62720#UAA862
informative reference: http://en.wikipedia.org/wiki/Millimetre
is unit of system: SI
prefix: Milli
symbol: mm
ucum code: mm
unece common code: MMT
label: Millimetre
alternative label: mil

Number
type: NamedIndividual
type: CountingUnit
type: Unit
description: Number is a unit for 'Dimensionless' expressed as (\#\).
has dimension vector: A0E0L0I0M0H0T0D1
has quantity kind: ChargeNumber
has quantity kind: Dimensionless
has quantity kind: DimensionlessRatio
has quantity kind: FrictionCoefficient
has quantity kind: HyperfineStructureQuantumNumber
has quantity kind: IonTransportNumber
has quantity kind: Landau-GinzburgNumber
has quantity kind: MagneticQuantumNumber
has quantity kind: MassNumber
has quantity kind: NeutronNumber
has quantity kind: NuclearSpinQuantumNumber
has quantity kind: NucleonNumber
has quantity kind: OrbitalAngularMomentumQuantumNumber
has quantity kind: Population
has quantity kind: PrincipalQuantumNumber
has quantity kind: QuantumNumber
has quantity kind: ReynoldsNumber
has quantity kind: SpinQuantumNumber
has quantity kind: StoichiometricNumber
has quantity kind: TotalAngularMomentumQuantumNumber
symbol: #
ucum code: 1
ucum code: {#}

Percent Relative Humidity
type: NamedIndividual
type: Unit
description: Percent relative humidity is the ratio of the partial pressure of water vapor to the equilibrium vapor pressure of water at a given temperature, expressed as a percentage.
applicable system: ASU
applicable system: CGS-ESU
applicable system: IMPERIAL
applicable system: PLANCK
applicable system: SI
conversion multiplier: 0.01
has dimension vector: A0E0L0I0M0H0T0D1
has quantity kind: RelativeHumidity
plain text description: Percent relative humidity is the ratio of the partial pressure of water vapor to the equilibrium vapor pressure of water at a given temperature, expressed as a percentage.
symbol: %RH

Watt per Square Meter
type: NamedIndividual
type: DerivedUnit
type: Unit
description: Watt per Square Meter} is a unit of irradiance defined as the power received per area. This is a unit in the category of Energy flux. It is also known as watts per square meter, watt per square metre, watts per square metre, watt/square meter, watt/square metre. This unit is commonly used in the SI unit system. Watt Per Square Meter (\(W/m^2\)) has a dimension of \(MT^{-3\) where M is mass, and T is time. This unit is the standard SI unit in this category.
conversion multiplier: 1.0
defined unit of system: SI
derived coherent unit of system: SI
expression: \(W/m^2\)
has dimension vector: A0E0L0I0M1H0T-3D0
has quantity kind: PowerPerArea
has quantity kind: PoyntingVector
iec61360 code: 0112/2///62720#UAA310
informative reference: http://www.efunda.com/glossary/units/units--energy_flux--watt_per_square_meter.cfm
symbol: W/m²
ucum code: W.m-2
ucum code: W/m2
unece common code: D54
label: Watt per Square Metre

air pressure
type: NamedIndividual
type: Meteorology Property
is observed by: Barometer AEMET SENSOR UTIEL
is observed by: Barometer EddyCovariance Sensor 1
canonical units: Hectopascal or Kilopascal
Source: Climate and Forecast (CF) Standard Names. http://mmisw.org/ont/cf/parameter
definition: Air pressure is the force per unit area which would be exerted when the moving gas molecules of which the air is composed strike a theoretical surface of any orientation.

air temperature
type: NamedIndividual
type: Meteorology Property
is observed by: Thermometer AEMET Sensor UTIEL
is observed by: Thermometer EddyCovariance Sensor 1
canonical units: Celsius
Source: Climate and Forecast (CF) Standard Names. http://mmisw.org/ont/cf/parameter
definition: Air temperature is the bulk temperature of the air, not the surface (skin) temperature.

duration of sunshine
type: NamedIndividual
type: Atmosphere Property
is observed by: Heliograph AEMET Sensor UTIEL
Source: https://mmisw.org/ont/cf/parameter/
comment: The WMO definition of sunshine is that the surface incident radiative flux from the solar beam (i.e. excluding diffuse skylight) exceeds 120 W m-2. 'Duration' is the length of time for which a condition holds.

FAPAR
type: NamedIndividual
type: Vegetation Property
is observed by: FAPAR 8days 500m a Sensor 1
is observed by: FAPAR 8days 500m t Sensor 1
is observed by: FAPAR L8 Sensor 1
is observed by: FAPAR L9 Sensor 1
is observed by: FAPAR S2 Sensor 1
is observed by: FAPAR UAV Multispectral Sensor 1
is observed by: FAPAR dhp Sensor 1
is observed by: FAPAR dhp Sensor 2
is observed by: FAPAR dhp Sensor 3
is observed by: FAPAR g Sensor 1
is observed by: FAPAR g Sensor 2
is observed by: FAPAR g Sensor 3
is observed by: FAPAR g Sensor 4
is observed by: GIFAPAR S3 Sensor 1
canonical units: 1
Source: Climate and Forecast (CF) Standard Names (v.78). http://mmisw.org/ont/cf/parameter
definition: Downwelling radiation is radiation from above. It does not mean net downward. The sign convention is that upwelling is positive upwards and downwelling is positive downwards. The surface called surface means the lower boundary of the atmosphere. The quantity with standard name fraction_of_surface_downwelling_photosynthetic_radiative_flux_absorbed_by_vegetation, often called Fraction of Absorbed Photosynthetically Active Radiation (FAPAR), is the fraction of incoming solar radiation in the photosynthetically active radiation spectral region that is absorbed by a vegetation canopy. Photosynthetic radiation is the part of the spectrum which is used in photosynthesis e.g. 400-700 nm. The range of wavelengths could be specified precisely by the bounds of a coordinate of radiation_wavelength. When thought of as being incident on a surface, a radiative flux is sometimes called irradiance. In addition, it is identical with the quantity measured by a cosine-collector light-meter and sometimes called vector irradiance. In accordance with common usage in geophysical disciplines, flux implies per unit area, called flux density in physics. Vegetation means any plants e.g. trees, shrubs, grass. The term plants refers to the kingdom of plants in the modern classification which excludes fungi. Plants are autotrophs i.e. producers of biomass using carbon obtained from carbon dioxide.

Landcover
type: NamedIndividual
type: Vegetation Property
is observed by: LandCover S2 Sensor 1
Source: Climate and Forecast (CF) Standard Names (v.78). http://mmisw.org/ont/cf/parameter
definition: A variable with the standard name of land_cover_lccs contains strings which indicate the nature of the surface, e.g. cropland_..., tree_... . Each string should represent a land cover class constructed using the Land Cover Classification System (LCCS; Di Gregorio A., 2005, UN Land Cover Classification System (LCCS) - Classification concepts and user manual for Software version 2; available at www.fao.org/DOCREP/003/X0596E/X0596e00.htm). String values should represent the classifiers used to define each class.

LAI
type: NamedIndividual
type: Vegetation Property
is observed by: LAI L8 Sensor 1
is observed by: LAI L9 Sensor 1
is observed by: LAI S2 Sensor 1
is observed by: LAI UAV Multispectral Sensor 1
is observed by: LAI dhp Sensor 1
is observed by: LAI dhp Sensor 2
is observed by: LAI dhp Sensor 3
is observed by: LAI g Sensor 1
is observed by: LAI g Sensor 2
canonical units: 1
Source: Climate and Forecast (CF) Standard Names (v.78). http://mmisw.org/ont/cf/parameter
definition: X_area means the horizontal area occupied by X within the grid cell.

Nitrogen_Concentration
type: NamedIndividual
type: Vegetation Property
is observed by: N2 g Sensor 1
description: Nitrogen dioxide or nitrogen(IV) oxide (NO2) is a chemical compound composed of the elements nitrogen and oxygen, one of the major pollutants among the various nitrogen oxides. Nitrogen dioxide has a brownish-yellow color. It forms as a byproduct in high-temperature combustion processes, such as those in motor vehicles and power plants. Therefore, it is a common pollutant in urban areas.

NDVI
type: NamedIndividual
type: Vegetation Property
is observed by: NDVI 16days 1km a Sensor 1
is observed by: NDVI 16days 1km t Sensor 1
is observed by: NDVI 16days 250m a Sensor 1
is observed by: NDVI 16days 250m t Sensor 1
is observed by: NDVI 16days 500m a Sensor 1
is observed by: NDVI 16days 500m t Sensor 1
is observed by: NDVI L8 Sensor 1
is observed by: NDVI L9 Sensor 1
is observed by: NDVI S2 Sensor 1
is observed by: NDVI UAV Multispectral Sensor 1
is observed by: NDVI diary 500m a Sensor 1
is observed by: NDVI diary 500m t Sensor 1
canonical units: 1
Source: Climate and Forecast (CF) Standard Names (v.78). http://mmisw.org/ont/cf/parameter
comment: NDVI quantifies the liveliness of green vegetation in an area.
definition: Normalized_difference_vegetation_index, usually abbreviated to NDVI, is an index calculated from reflectances measured in the visible and near infrared channels. It is calculated as NDVI = (NIR - R) / (NIR + R) where NIR is the reflectance in the near-infrared band and R is the reflectance in the red visible band. Reflectance is the ratio of the reflected over the incoming radiation in each spectral band. The calculated value of NDVI depends on the precise definitions of the spectral bands and these definitions may vary between different models and remote sensing instruments.

soil albedo
type: NamedIndividual
type: Radiation Property
is observed by: SurfaceAlbedo g RAD Sensor 1
canonical units: 1
Source: Climate and Forecast (CF) Standard Names (v.78). http://mmisw.org/ont/cf/parameter
definition: Soil albedo is the albedo of the soil surface assuming no snow. Albedo is the ratio of outgoing to incoming shortwave irradiance, where 'shortwave irradiance' means that both the incoming and outgoing radiation are integrated across the solar spectrum.

surface downwelling longwave flux in air
type: NamedIndividual
type: Radiation Property
is observed by: LW down g RAD Sensor 1
canonical units: W m-2
Source: Climate and Forecast (CF) Standard Names. http://mmisw.org/ont/cf/parameter
definition: The surface called surface means the lower boundary of the atmosphere. Downwelling radiation is radiation from above. It does not mean net downward. The sign convention is that upwelling is positive upwards and downwelling is positive downwards. The term longwave means longwave radiation. When thought of as being incident on a surface, a radiative flux is sometimes called irradiance. In addition, it is identical with the quantity measured by a cosine-collector light-meter and sometimes called vector irradiance. In accordance with common usage in geophysical disciplines, flux implies per unit area, called flux density in physics.

surface downwelling shortwave flux in air
type: NamedIndividual
type: Radiation Property
is observed by: SW down g RAD Sensor 1
canonical units: W m-2
Source: Climate and Forecast (CF) Standard Names. http://mmisw.org/ont/cf/parameter
definition: The surface called surface means the lower boundary of the atmosphere. Downwelling radiation is radiation from above. It does not mean net downward. The sign convention is that upwelling is positive upwards and downwelling is positive downwards. The term shortwave means shortwave radiation. Surface downwelling shortwave is the sum of direct and diffuse solar radiation incident on the surface, and is sometimes called global radiation. When thought of as being incident on a surface, a radiative flux is sometimes called irradiance. In addition, it is identical with the quantity measured by a cosine-collector light-meter and sometimes called vector irradiance. In accordance with common usage in geophysical disciplines, flux implies per unit area, called flux density in physics.

surface longwave emissivity
type: NamedIndividual
type: Land Surface Property
is observed by: LSE g Sensor 1
is observed by: LSE g Sensor 2
is observed by: LSE g Sensor 3
is observed by: LSE g Sensor 4
is observed by: LSE g Sensor 5
is observed by: LSE g Sensor 6
canonical units: 1
Source: Climate and Forecast (CF) Standard Names. http://mmisw.org/ont/cf/parameter
definition: Emissivity is the ratio of the power emitted by an object to the power that would be emitted by a perfect black body having the same temperature as the object. The emissivity is assumed to be an integral over all wavelengths, unless a coordinate of radiation_wavelength or radiation_frequency is included to specify either the wavelength or frequency. The surface called surface means the lower boundary of the atmosphere. longwave means longwave radiation.

LST
type: NamedIndividual
type: Land Surface Property
is observed by: LST 8days 1km a Sensor 1
is observed by: LST 8days 1km t Sensor 1
is observed by: LST L8 Sensor 1
is observed by: LST L9 Sensor 1
is observed by: LST S3 Sensor 1
is observed by: LST UAV Thermal Sensor 1
is observed by: LST diary 1km a Sensor 1
is observed by: LST diary 1km t Sensor 1
is observed by: LST g Sensor 1
canonical units: Celsius
Source: Climate and Forecast (CF) Standard Names. http://mmisw.org/ont/cf/parameter
definition: The surface called surface means the lower boundary of the atmosphere. The surface temperature is the temperature at the interface, not the bulk temperature of the medium above or below. Unless indicated in the cell_methods attribute, a quantity is assumed to apply to the whole area of each horizontal grid box. Previously, the qualifier where_type was used to specify that the quantity applies only to the part of the grid box of the named type. Names containing the where_type qualifier are deprecated and newly created data should use the cell_methods attribute to indicate the horizontal area to which the quantity applies.

surface water evaporation flux
type: NamedIndividual
type: Land Atmosphere Interaction Property
is observed by: WaterVapourFlux g EddyCovariance Sensor 1
canonical units: kg m-2 s-1
Source: Climate and Forecast (CF) Standard Names (v.78). http://mmisw.org/ont/cf/parameter
definition: The surface called surface means the lower boundary of the atmosphere. Water means water in all phases, including frozen i.e. ice and snow. Evaporation is the conversion of liquid or solid into vapor. (The conversion of solid alone into vapor is called sublimation). The quantity with standard name surface_water_evaporation_flux does not include transpiration from vegetation. In accordance with common usage in geophysical disciplines, flux implies per unit area, called flux density in physics. Unless indicated in the cell_methods attribute, a quantity is assumed to apply to the whole area of each horizontal grid box. Previously, the qualifier where_type was used to specify that the quantity applies only to the part of the grid box of the named type. Names containing the where_type qualifier are deprecated and newly created data should use the cell_methods attribute to indicate the horizontal area to which the quantity applies.

upward latent heat flux in air
type: NamedIndividual
type: Vegetation Property
is observed by: LE g EddyCovariance Sensor 1
Source: https://mmisw.org/ont/cf/parameter/
comment: "Upward" indicates a vector component which is positive when directed upward (negative downward). The latent heat flux is the exchange of heat across a surface on account of evaporation and condensation (including sublimation and deposition). In accordance with common usage in geophysical disciplines, "flux" implies per unit area, called "flux density" in physics.

upwelling longwave flux in air
type: NamedIndividual
type: Radiation Property
is observed by: LW up g RAD Sensor 1
canonical units: W m-2
Source: Climate and Forecast (CF) Standard Names (v.78). http://mmisw.org/ont/cf/parameter
definition: The term longwave means longwave radiation. Upwelling radiation is radiation from below. It does not mean net upward. The sign convention is that upwelling is positive upwards and downwelling is positive downwards. When thought of as being incident on a surface, a radiative flux is sometimes called irradiance. In addition, it is identical with the quantity measured by a cosine-collector light-meter and sometimes called vector irradiance. In accordance with common usage in geophysical disciplines, flux implies per unit area, called flux density in physics.

upwelling shortwave flux in air
type: NamedIndividual
type: Radiation Property
is observed by: SW up g RAD Sensor 1
canonical units: W m-2
Source: Climate and Forecast (CF) Standard Names (v.78). http://mmisw.org/ont/cf/parameter
definition: The term shortwave means shortwave radiation. Upwelling radiation is radiation from below. It does not mean net upward. The sign convention is that upwelling is positive upwards and downwelling is positive downwards. When thought of as being incident on a surface, a radiative flux is sometimes called irradiance. In addition, it is identical with the quantity measured by a cosine-collector light-meter and sometimes called vector irradiance. In accordance with common usage in geophysical disciplines, flux implies per unit area, called flux density in physics.

vegetation area fraction
type: NamedIndividual
type: Vegetation Property
is observed by: FCOVER dhp Sensor 1
is observed by: FCOVER dhp Sensor 2
is observed by: FCOVER dhp Sensor 3
canonical units: 1
Source: Climate and Forecast (CF) Standard Names. http://mmisw.org/ont/cf/parameter
definition: Area fraction is the fraction of a grid cell's horizontal area that has some characteristic of interest. It is evaluated as the area of interest divided by the grid cell area. It may be expressed as a fraction, a percentage, or any other dimensionless representation of a fraction. Vegetation means any plants e.g. trees, shrubs, grass. The term plants refers to the kingdom of plants in the modern classification which excludes fungi. Plants are autotrophs i.e. producers of biomass using carbon obtained from carbon dioxide.

water evapotranspiration flux
type: NamedIndividual
type: Land Atmosphere Interaction Property
canonical units: kg m-2 s-1
Source: Climate and Forecast (CF) Standard Names. http://mmisw.org/ont/cf/parameter
definition: Water means water in all phases. Evapotranspiration means all water vapor fluxes into the atmosphere from the surface: liquid evaporation, sublimation and transpiration. Evaporation is the conversion of liquid or solid into vapor. Transpiration is the process by which water is carried from the roots of plants and evaporates from the stomata. (The conversion of solid alone into vapor is called sublimation.) In accordance with common usage in geophysical disciplines, flux implies per unit area, called flux density in physics. Unless indicated in the cell_methods attribute, a quantity is assumed to apply to the whole area of each horizontal grid box.

wind from direction
type: NamedIndividual
type: Meteorology Property
is observed by: WindVane AEMET Sensor UTIEL
is observed by: WindVane EddyCovariance Sensor 1
canonical units: degree
Source: Climate and Forecast (CF) Standard Names. http://mmisw.org/ont/cf/parameter
definition: Wind is defined as a two-dimensional (horizontal) air velocity vector, with no vertical component. (Vertical motion in the atmosphere has the standard name upward_air_velocity.) In meteorological reports, the direction of the wind vector is usually (but not always) given as the direction from which it is blowing (wind_from_direction) (westerly, northerly, etc.). In other contexts, such as atmospheric modelling, it is often natural to give the direction in the usual manner of vectors as the heading or the direction to which it is blowing (wind_to_direction) (eastward, southward, etc.) from_direction is used in the construction X_from_direction and indicates the direction from which the velocity vector of X is coming.

wind speed
type: NamedIndividual
type: Meteorology Property
is observed by: Anemometer AEMET Sensor UTIEL
is observed by: Anemometer EddyCovariance Sensor 1
canonical units: m s-1
Source: Climate and Forecast (CF) Standard Names. http://mmisw.org/ont/cf/parameter
definition: Speed is the magnitude of velocity. Wind is defined as a two-dimensional (horizontal) air velocity vector, with no vertical component. (Vertical motion in the atmosphere has the standard name upward_air_velocity.) The wind speed is the magnitude of the wind velocity.

precipitation amount
type: NamedIndividual
type: Atmosphere Property
is observed by: Pluviometer AEMET Sensor UTIEL
Source: https://mmisw.org/ont/ioos/parameter/
comment: The deposit of atmospheric moisture as rain, hail, sleet, snow, frost or dew. Precipition amount is often measured as depth of liquid equivalent moisture at a point but also can be expressed as liquid volume or mass per unit area.
comment: mm | ml | kg m-2

relative humidity
type: NamedIndividual
type: Meteorology Property
is observed by: Hygrometer AEMET Sensor UTIEL
is observed by: Hygrometer EddyCovariance Sensor 1
Source: https://mmisw.org/ont/ioos/parameter/
comment: Amount of moisture in the air as vapor relative to how much it can possibly hold at the same temperature.

sensible_heat_flux
type: NamedIndividual
type: Land Atmosphere Interaction Property
is observed by: Hs g EddyCovariance Sensor 1
comment: Sensible heat flux refers to the transfer of heat energy between the Earth's surface and the atmosphere due to a difference in temperature. A positive sensible heat flux means heat is flowing from the atmosphere to the surface. A negative sensible heat flux means heat is flowing from the surface to the atmosphere.

Carbon_Dioxide_Flux
type: NamedIndividual
type: Land Atmosphere Interaction Property
is observed by: CarbonDioxideFlux g EddyCovariance Sensor 1
comment: Carbon dioxide (CO2) flux refers to the movement or exchange of carbon dioxide between different parts of the Earth's environment, such as the atmosphere, land, and oceans.

AEMET UTIEL Station
type: NamedIndividual
type: AEMET_Station
hasGeometry: GeoAEMET UTIEL Station
hosts: Anemometer AEMET Sensor UTIEL
hosts: Barometer AEMET SENSOR UTIEL
hosts: Clock AEMET Sensor UTIEL
hosts: Heliograph AEMET Sensor UTIEL
hosts: Hygrometer AEMET Sensor UTIEL
hosts: Pluviometer AEMET Sensor UTIEL
hosts: Thermometer AEMET Sensor UTIEL
hosts: WindVane AEMET Sensor UTIEL
control area: 10x10 Area
has type of cover: Vineyards
Located in municipality: Utiel
Located in province: Valencia/València
comment: The meteorological station named "La Cubera" is close to the municipality of 'Utiel', at an altitude of 758 meters above sea level, and near Vereda Real, Casa de la Cubera, Camino de la Solana, Camino de Cuenca, La Solana, Caz del Soto Magro, Rambla del Colmenar, Casas de Santa Bárbara, Cañada del Campo, La Vega….

AGB SMOS CATDS Sensor 1
type: NamedIndividual
type: RS SMOS
is hosted by: SMOS Product 1
observes: AGB
comment: AGB_SMOS_CATDS Sensor hosted by SMOS Product_1

AGB UAV Hyperspectral Sensor 1
type: NamedIndividual
type: RS UAV Hyperspectral
is hosted by: UAV Hyperspectral 1
observes: AGB
comment: Sensor AGB UAV Hyperspectral hosted by UAV Hyperspectral 1.

AGB UAV LiDAR Sensor 1
type: NamedIndividual
type: RS UAV LiDAR
is hosted by: UAV LiDAR 1
observes: AGB
comment: Sensor AGB UAV LiDAR hosted by UAV LiDAR 1.

Anemometer AEMET Sensor UTIEL
type: NamedIndividual
type: Anemometer_AEMET
is hosted by: AEMET UTIEL Station
observes: wind speed
comment: Sensor Anemometer_AEMET hosted by AEMET_UTIEL_Station

Anemometer EddyCovariance Sensor 1
type: NamedIndividual
type: Anemometer EddyCovariance
is hosted by: EddyCovariance Station 1
observes: wind speed
comment: Sensor Anemometer_EddyCovariance hosted by EddyCovariance_Station_1

Artificial Surfaces
type: NamedIndividual
type: Land Cover Classes
code CLC: 100
comment: Class Level 1 CORINE Land Cover - CLC

Bare Soils
type: NamedIndividual
type: Land Cover Classes
code CLC: 331
comment: A soil surface devoid of any plant material.

Barometer AEMET SENSOR UTIEL
type: NamedIndividual
type: Barometer_AEMET
is hosted by: AEMET UTIEL Station
observes: air pressure
comment: Sensor Barometer_AEMET hosted by AEMET_UTIEL_Station

Barometer EddyCovariance Sensor 1
type: NamedIndividual
type: Barometer EddyCovariance
is hosted by: EddyCovariance Station 1
observes: air pressure
comment: Sensor Barometer_EddyCovariance hosted by EddyCovariance_Station_1

CHM UAV LiDAR Sensor 1
type: NamedIndividual
type: RS UAV LiDAR
is hosted by: UAV LiDAR 1
observes: CHM
comment: Sensor CHM UAV LiDAR hosted by UAV LiDAR 1.

CRI UAV Hyperspectral Sensor 1
type: NamedIndividual
type: RS UAV Hyperspectral
is hosted by: UAV Hyperspectral 1
observes: CRI
comment: Sensor CRI UAV Hyperspectral hosted by UAV Hyperspectral 1.

CHM
type: NamedIndividual
type: Soil Property
type: Vegetation Property
is observed by: CHM UAV LiDAR Sensor 1
comment: Canopy Height Model (CHM) The CHM is a derived LiDAR product that represents vegetation height above ground, computed as the difference between the DSM and the DTM: CHM = DSM − DTM It is delivered as a raster map in meters (m).

CarbonDioxideFlux g EddyCovariance Sensor 1
type: NamedIndividual
type: CarbonDioxideFlux g
is hosted by: EddyCovariance Station 1
observes: Carbon_Dioxide_Flux
comment: Sensor CarbonDioxideFlux_g_EddyCovariance hosted by EddyCovariance_Station_1

Chl L8 Sensor 1
type: NamedIndividual
type: RS Landsat-8
is hosted by: Landsat-8 Product 1
observes: Chl
comment: Chl_L8 Sensor hosted by Landsat-8 Product_1

Chl L9 Sensor 1
type: NamedIndividual
type: RS Landsat-9
is hosted by: Landsat-9 Product 1
observes: Chl
comment: Chl_L9 Sensor hosted by Landsat-9 Product_1

Chl S2 Sensor 1
type: NamedIndividual
type: RS Sentinel-2
is hosted by: Sentinel-2 Product 1
observes: Chl
comment: Chl_S2 Sensor hosted by Sentinel-2 Product_1

Chl Station 1
type: NamedIndividual
type: Chl_Station
hasGeometry: GeoChlStation1
hosts: Chl g Sensor 1
control area: 1x1 Area
has type of cover: Vineyards
Located in municipality: Caudete de las Fuentes
Located in province: Valencia/València
comment: Chl Station number 1

Chl g Sensor 1
type: NamedIndividual
type: Chl g
is hosted by: Chl Station 1
observes: Chl
comment: Sensor Chl_g hosted by Chl_Station_1

Clock AEMET Sensor UTIEL
type: NamedIndividual
type: Clock_AEMET
is hosted by: AEMET UTIEL Station
observes: time
comment: Sensor Clock_AEMET hosted by AEMET_UTIEL_Station

CloudMask METEOSAT Sensor 1
type: NamedIndividual
type: RS METEOSAT
is hosted by: METEOSAT Product 1
observes: cloud mask
comment: CloudMask_METEOSAT Sensor hosted by METEOSAT Product_1

CloudType METEOSAT Sensor 1
type: NamedIndividual
type: RS METEOSAT
is hosted by: METEOSAT Product 1
observes: cloud type
comment: CloudType_METEOSAT Sensor hosted by METEOSAT Product_1

Coniferous Forest
type: NamedIndividual
type: Land Cover Classes
code CLC: 311
comment: Class Level 3 CORINE Land Cover - CLC

DBH UAV LiDAR Sensor 1
type: NamedIndividual
type: RS UAV LiDAR
is hosted by: UAV LiDAR 1
observes: DBH
comment: Sensor DBH UAV LiDAR hosted by UAV LiDAR 1.

DHP Station 1
type: NamedIndividual
type: DHP_Station
hasGeometry: GeoDHPStation1
hosts: FAPAR dhp Sensor 1
hosts: FCOVER dhp Sensor 1
hosts: LAI dhp Sensor 1
control area: 1x1 Area
has type of cover: Vineyards
Located in municipality: Caudete de las Fuentes
Located in province: Valencia/València
comment: DHP Station number 1

DHP Station 2
type: NamedIndividual
type: DHP_Station
hasGeometry: GeoDHPStation2
hosts: FAPAR dhp Sensor 2
hosts: FCOVER dhp Sensor 2
hosts: LAI dhp Sensor 2
control area: 1x1 Area
has type of cover: Fruit trees and berry plantations (olive, almond)
Located in municipality: Caudete de las Fuentes
Located in province: Valencia/València
comment: DHP Station number 2

DHP Station 3
type: NamedIndividual
type: DHP_Station
hasGeometry: GeoDHPStation3
hosts: FAPAR dhp Sensor 3
hosts: FCOVER dhp Sensor 3
hosts: LAI dhp Sensor 3
control area: 10x10 Area
has type of cover: Sclerophyllous vegetation
Located in municipality: Caudete de las Fuentes
Located in province: Valencia/València
comment: DHP Station number 3

DSM UAV LiDAR Sensor 1
type: NamedIndividual
type: RS UAV LiDAR
is hosted by: UAV LiDAR 1
observes: DSM
comment: Sensor DSM UAV LiDAR hosted by UAV LiDAR 1.

DTM UAV LiDAR Sensor 1
type: NamedIndividual
type: RS UAV LiDAR
is hosted by: UAV LiDAR 1
observes: DTM
comment: Sensor DTM UAV LiDAR hosted by UAV LiDAR 1.

DSM
type: NamedIndividual
type: Soil Property
type: Vegetation Property
is observed by: DSM UAV LiDAR Sensor 1
comment: Digital Surface Model (DSM). A DSM is a LiDAR-derived raster representing the elevation of the uppermost surfaces in the scene, including vegetation, buildings, and all above-ground objects. Pixel values correspond to absolute height in meters (m).

DTM
type: NamedIndividual
type: Soil Property
is observed by: DTM UAV LiDAR Sensor 1
comment: Digital Terrain Model (DTM). A DTM is a LiDAR-derived raster representing the elevation of the bare ground surface, with vegetation and artificial structures removed. Each pixel stores the ground height expressed in meters (m).

DiseaseStatus UAV Hyperspectral Sensor 1
type: NamedIndividual
type: RS UAV Hyperspectral
is hosted by: UAV Hyperspectral 1
observes: DiseaseStatus
comment: Sensor Diseasestatus UAV Hyperspectral hosted by UAV Hyperspectral 1.

DroughtIndex SMOS CATDS Sensor 1
type: NamedIndividual
type: RS SMOS
is hosted by: SMOS Product 1
observes: Drought
comment: DroughtIndex_SMOS_CATDS Sensor hosted by SMOS Product_1

EVI L8 Sensor 1
type: NamedIndividual
type: RS Landsat-8
is hosted by: Landsat-8 Product 1
observes: EVI
comment: EVI_L8 Sensor hosted by Landsat-8 Product_1

EVI L9 Sensor 1
type: NamedIndividual
type: RS Landsat-9
is hosted by: Landsat-9 Product 1
observes: EVI
comment: EVI_L9 Sensor hosted by Landsat-9 Product_1

EVI S2 Sensor 1
type: NamedIndividual
type: RS Sentinel-2
is hosted by: Sentinel-2 Product 1
observes: EVI
comment: EVI_S2 Sensor hosted by Sentinel-2 Product_1

EVI UAV Multispectral Sensor 1
type: NamedIndividual
type: RS UAV Multispectral
is hosted by: UAV Multispectral 1
observes: EVI
comment: Sensor EVI UAV Multispectral hosted by UAV Multispectral 1.

EVI diary 500m a Sensor 1
type: NamedIndividual
type: RS MODIS-Aqua
is hosted by: MODIS-Aqua Product 1
observes: EVI
comment: EVI_diary_500m_a Sensor hosted by MODIS-Aqua Product_1

EVI diary 500m t Sensor 1
type: NamedIndividual
type: RS MODIS-Terra
is hosted by: MODIS-Terra Product 1
observes: EVI
comment: EVI_diary_500m_t Sensor hosted by MODIS-TerraProduct_1

EddyCovariance Station 1
type: NamedIndividual
type: EddyCovariance_Station
hasGeometry: GeoEddyCovariance Station1
hosts: Anemometer EddyCovariance Sensor 1
hosts: Barometer EddyCovariance Sensor 1
hosts: CarbonDioxideFlux g EddyCovariance Sensor 1
hosts: Hs g EddyCovariance Sensor 1
hosts: Hygrometer EddyCovariance Sensor 1
hosts: LE g EddyCovariance Sensor 1
hosts: Thermometer EddyCovariance Sensor 1
hosts: WaterVapourFlux g EddyCovariance Sensor 1
hosts: WindVane EddyCovariance Sensor 1
control area: 1x1 Area
has type of cover: Vineyards
Located in municipality: Caudete de las Fuentes
Located in province: Valencia/València
comment: EddyCovariance Station number 1

FAPAR 8days 500m a Sensor 1
type: NamedIndividual
type: RS MODIS-Aqua
is hosted by: MODIS-Aqua Product 1
observes: FAPAR
comment: FAPAR_8days_500m_a Sensor hosted by MODIS-Aqua Product_1

FAPAR 8days 500m t Sensor 1
type: NamedIndividual
type: RS MODIS-Terra
is hosted by: MODIS-Terra Product 1
observes: FAPAR
comment: FAPAR_8days_500m_t Sensor hosted by MODIS-TerraProduct_1

FAPAR L8 Sensor 1
type: NamedIndividual
type: RS Landsat-8
is hosted by: Landsat-8 Product 1
observes: FAPAR
comment: FAPAR_L8 Sensor hosted by Landsat-8 Product_1

FAPAR L9 Sensor 1
type: NamedIndividual
type: RS Landsat-9
is hosted by: Landsat-9 Product 1
observes: FAPAR
comment: FAPAR_L9 Sensor hosted by Landsat-9 Product_1

FAPAR S2 Sensor 1
type: NamedIndividual
type: RS Sentinel-2
is hosted by: Sentinel-2 Product 1
observes: FAPAR
comment: FAPAR_S2 Sensor hosted by Sentinel-2 Product_1

FAPAR_Station_1
type: NamedIndividual
type: FAPAR_Station
hasGeometry: GeoFaparStation1
hosts: FAPAR g Sensor 1
control area: 1x1 Area
has type of cover: Vineyards
Located in municipality: Caudete de las Fuentes
Located in province: Valencia/València
comment: FAPAR Station number 1

FAPAR_Station_2
type: NamedIndividual
type: FAPAR_Station
hasGeometry: GeoFaparStation2
hosts: FAPAR g Sensor 2
control area: 1x1 Area
has type of cover: Vineyards
Located in municipality: Caudete de las Fuentes
Located in province: Valencia/València
comment: FAPAR Station number 2

FAPAR_Station_3
type: NamedIndividual
type: FAPAR_Station
hasGeometry: GeoFaparStation3
hosts: FAPAR g Sensor 3
control area: 1x1 Area
has type of cover: Vineyards
Located in municipality: Caudete de las Fuentes
Located in province: Valencia/València
comment: FAPAR Station number 3

FAPAR_Station_4
type: NamedIndividual
type: FAPAR_Station
hasGeometry: GeoFaparStation4
hosts: FAPAR g Sensor 4
control area: 1x1 Area
has type of cover: Fruit trees and berry plantations (olive, almond)
Located in municipality: Caudete de las Fuentes
Located in province: Valencia/València
comment: FAPAR Station number 4

FAPAR UAV Multispectral Sensor 1
type: NamedIndividual
type: RS UAV Multispectral
is hosted by: UAV Multispectral 1
observes: FAPAR
comment: Sensor FAPAR UAV Multispectral hosted by UAV Multispectral 1.

FAPAR dhp Sensor 1
type: NamedIndividual
type: FAPAR dhp
is hosted by: DHP Station 1
observes: FAPAR
comment: Sensor FAPAR_dhp hosted by DHP_Station_1

FAPAR dhp Sensor 2
type: NamedIndividual
type: FAPAR dhp
is hosted by: DHP Station 2
observes: FAPAR
comment: Sensor FAPAR_dhp hosted by DHP_Station_2

FAPAR dhp Sensor 3
type: NamedIndividual
type: FAPAR dhp
is hosted by: DHP Station 3
observes: FAPAR
comment: Sensor FAPAR_dhp hosted by DHP_Station_3

FAPAR g Sensor 1
type: NamedIndividual
type: FAPAR g
is hosted by: FAPAR_Station_1
observes: FAPAR
comment: Sensor FAPAR_g hosted by FAPAR_Station_1

FAPAR g Sensor 2
type: NamedIndividual
type: FAPAR g
is hosted by: FAPAR_Station_2
observes: FAPAR
comment: Sensor FAPAR_g hosted by FAPAR_Station_2

FAPAR g Sensor 3
type: NamedIndividual
type: FAPAR g
is hosted by: FAPAR_Station_3
observes: FAPAR
comment: Sensor FAPAR_g hosted by FAPAR_Station_3

FAPAR g Sensor 4
type: NamedIndividual
type: FAPAR g
is hosted by: FAPAR_Station_4
observes: FAPAR
comment: Sensor FAPAR_g hosted by FAPAR_Station_4

FCOVER dhp Sensor 1
type: NamedIndividual
type: FCOVER dhp
is hosted by: DHP Station 1
observes: vegetation area fraction
comment: Sensor FCOVER_dhp hosted by DHP_Station_1

FCOVER dhp Sensor 2
type: NamedIndividual
type: FCOVER dhp
is hosted by: DHP Station 2
observes: vegetation area fraction
comment: Sensor FCOVER_dhp hosted by DHP_Station_2

FCOVER dhp Sensor 3
type: NamedIndividual
type: FCOVER dhp
is hosted by: DHP Station 3
observes: vegetation area fraction
comment: Sensor FCOVER_dhp hosted by DHP_Station_3

GIFAPAR S3 Sensor 1
type: NamedIndividual
type: RS Sentinel-3 OLCI
is hosted by: Sentinel-3 OLCI Product 1
observes: FAPAR
comment: GIFAPAR_S3 Sensor hosted by Sentinel-3_OLCI Product_1

GeoAEMET UTIEL Station
type: NamedIndividual
type: Point
as WKT: POINT(-1.2448266 39.5756304)
comment: Geometry for AEMET_UTIEL Station

GeoArea10x10
type: NamedIndividual
type: Polygon
comment: Geometry for Area 10x10

GeoArea1x1
type: NamedIndividual
type: Polygon
comment: Geometry for Area 1x1

GeoChlStation1
type: NamedIndividual
type: Point
as WKT: POINT(-1.288622074710214 39.57021941427273)
comment: Geometry for ChlStation1

GeoDHPStation1
type: NamedIndividual
type: Point
as WKT: POINT(-1.288622074710214 39.57021941427273)
comment: Geometry for DHPStation1.

GeoDHPStation2
type: NamedIndividual
type: Point
as WKT: POINT(-1.2847441664077326 39.570841503829705)
comment: Geometry for DHPStation2.

GeoDHPStation3
type: NamedIndividual
type: Point
as WKT: POINT(-1.2951787557504284 39.5737892463047)
comment: Geometry for DHPStation3.

GeoEddyCovariance Station1
type: NamedIndividual
type: Point
as WKT: POINT(-1.2883633273781312 39.57131761093812)
comment: Geometry for EddyCovariance_Station1.

GeoFaparStation1
type: NamedIndividual
type: Point
as WKT: POINT(-1.28841896067973 39.571199347105676)
comment: Geometry of FPARStation1

GeoFaparStation2
type: NamedIndividual
type: Point
as WKT: POINT(-1.2880175117684332 39.570549130066915)
comment: Geometry of FAPAR Station 2

GeoFaparStation3
type: NamedIndividual
type: Point
as WKT: POINT(-1.289300714535875 39.57036677348055)
comment: Geometry of FAPAR Station 2

GeoFaparStation4
type: NamedIndividual
type: Point
as WKT: POINT(-1.2913354241076542 39.56917563637111)
comment: Geometry of FAPAR Station 4

GeoLAIStation1
type: NamedIndividual
type: Point
as WKT: POINT(-1.288622074710214 39.57021941427273)
comment: Geometry of LAIStation1

GeoLAIStation2
type: NamedIndividual
type: Point
as WKT: POINT(-1.2847441664077326 39.570841503829705)
comment: Geometry of LAIStation2

GeoLSEStation1
type: NamedIndividual
type: Point
has serialization: POINT(-1.288301445220414 39.57061365081936)
comment: Geometry of LSEStation1

GeoLSEStation2
type: NamedIndividual
type: Point
as WKT: POINT(-1.2880338126128827 39.570644964498435)
comment: Geometry of LSEStation2

GeoLSEStation3
type: NamedIndividual
type: Point
as WKT: POINT(-1.2880816041499419 39.57087889565335)
comment: Geometry of LSEStation3

GeoLSEStation4
type: NamedIndividual
type: Point
as WKT: POINT(-1.2881771872240602 39.571355965404955)
comment: Geometry of LSEStation4

GeoLSEStation5
type: NamedIndividual
type: Point
as WKT: POINT(-1.2884519885621504 39.571306232418095)
comment: Geometry of LSEStation5

GeoLSEStation6
type: NamedIndividual
type: Point
as WKT: POINT(-1.2883516263343262 39.57084574010458)
comment: Geometry of LSEStation6

GeoLSTStation1
type: NamedIndividual
type: Point
as WKT: POINT(-1.2882106413000016 39.5707646931409)
comment: Geometry of LSTStation1

GeoN2Station1
type: NamedIndividual
type: Point
as WKT: POINT(-1.288622074710214 39.57021941427273)
comment: Geometry of N2Station1

GeoRADStation1
type: NamedIndividual
type: Point
as WKT: POINT(-1.288153881964872 39.57070980677462)
comment: Geometry of RADStation1

GeoSMStation1
type: NamedIndividual
type: Point
as WKT: POINT(-1.2882082517231486 39.570737063472514)
comment: Geometry of SMStation1

GeoSMStation2
type: NamedIndividual
type: Point
as WKT: POINT(-1.28841896067973 39.571199347105676)
comment: Geometry of SMStation2

GeoSMStation3
type: NamedIndividual
type: Point
as WKT: POINT(-1.2880175117684332 39.570549130066915)
comment: Geometry of SMStation3

GeoSMStation4
type: NamedIndividual
type: Point
as WKT: POINT(-1.2913354241076542 39.56917563637111)
comment: Geometry of SMStation4

GeoSMStation5
type: NamedIndividual
type: Point
as WKT: POINT(-1.289300714535875 39.57036677348055)
comment: Geometry of SMStation5

GeoSMStation6
type: NamedIndividual
type: Point
as WKT: POINT(-1.277015705423016 39.54823877922652)
comment: Geometry of SMStation6

Heliograph AEMET Sensor UTIEL
type: NamedIndividual
type: Heliograph_AEMET
is hosted by: AEMET UTIEL Station
observes: duration of sunshine
comment: Sensor Heliograph_AEMET hosted by AEMET_UTIEL_Station

Hs g EddyCovariance Sensor 1
type: NamedIndividual
type: Hs g
is hosted by: EddyCovariance Station 1
observes: sensible_heat_flux
comment: Hs_g_EddyCovariance Sensor hosted by EddyCovariance_Station_1

Hygrometer AEMET Sensor UTIEL
type: NamedIndividual
type: Hygrometer_AEMET
is hosted by: AEMET UTIEL Station
observes: relative humidity
comment: Sensor Hygrometer_AEMET hosted by AEMET_UTIEL_Station

Hygrometer EddyCovariance Sensor 1
type: NamedIndividual
type: Hygrometer EddyCovariance
is hosted by: EddyCovariance Station 1
observes: relative humidity
comment: Hygrometer_EddyCovariance Sensor hosted by EddyCovariance_Station_1

I dif g RAD Sensor 1
type: NamedIndividual
type: I dif g
is hosted by: RAD Station 1
observes: diffuse_irradiance
comment: I_dif_g_RAD Sensor hosted by RAD_Station_1

I dir g RAD Sensor 1
type: NamedIndividual
type: I dir g
is hosted by: RAD Station 1
observes: direct_irradiance_at_the_surface
comment: I_dir_g_RAD Sensor hosted by RAD_Station_1

LAI L8 Sensor 1
type: NamedIndividual
type: RS Landsat-8
is hosted by: Landsat-8 Product 1
observes: LAI
comment: LAI_L8 Sensor hosted by Landsat-8 Product_1

LAI L9 Sensor 1
type: NamedIndividual
type: RS Landsat-9
is hosted by: Landsat-9 Product 1
observes: LAI
comment: LAI_L9 Sensor hosted by Landsat-9 Product_1

LAI S2 Sensor 1
type: NamedIndividual
type: RS Sentinel-2
is hosted by: Sentinel-2 Product 1
observes: LAI
comment: LAI_S2 Sensor hosted by Sentinel-2 Product_1

LAI Station 1
type: NamedIndividual
type: LAI_Station
hasGeometry: GeoLAIStation1
hosts: LAI g Sensor 1
control area: 1x1 Area
has type of cover: Vineyards
Located in municipality: Caudete de las Fuentes
Located in province: Valencia/València
comment: LAI Station number 1

LAI Station 2
type: NamedIndividual
type: LAI_Station
hasGeometry: GeoLAIStation2
hosts: LAI g Sensor 2
control area: 1x1 Area
has type of cover: Fruit trees and berry plantations (olive, almond)
Located in municipality: Caudete de las Fuentes
Located in province: Valencia/València
comment: LAI Station number 2

LAI UAV Multispectral Sensor 1
type: NamedIndividual
type: RS UAV Multispectral
is hosted by: UAV Multispectral 1
observes: LAI
comment: Sensor LAI UAV Multispectral hosted by UAV Multispectral 1.

LAI dhp Sensor 1
type: NamedIndividual
type: LAI dhp
is hosted by: DHP Station 1
observes: LAI
comment: Sensor LAI_dhp hosted by LAI_Station_1

LAI dhp Sensor 2
type: NamedIndividual
type: LAI dhp
is hosted by: DHP Station 2
observes: LAI
comment: Sensor LAI_dhp hosted by LAI_Station_2

LAI dhp Sensor 3
type: NamedIndividual
type: LAI dhp
is hosted by: DHP Station 3
observes: LAI
comment: Sensor LAI_dhp hosted by LAI_Station_3

LAI g Sensor 1
type: NamedIndividual
type: LAI g
is hosted by: LAI Station 1
observes: LAI
comment: Sensor LAI_g hosted by LAI_Station_1

LAI g Sensor 2
type: NamedIndividual
type: LAI g
is hosted by: LAI Station 2
observes: LAI
comment: Sensor LAI_g hosted by LAI_Station_2

LE g EddyCovariance Sensor 1
type: NamedIndividual
type: LE g
is hosted by: EddyCovariance Station 1
observes: upward latent heat flux in air
comment: Sensor LE_g_EddyCovariance hosted by EddyCovariance_Station_1

LSE Station 1
type: NamedIndividual
type: LSE_Station
hasGeometry: GeoLSEStation1
hosts: LSE g Sensor 1
control area: 1x1 Area
has type of cover: Vineyards
Located in municipality: Caudete de las Fuentes
Located in province: Valencia/València
comment: LSE Station number 1

LSE Station 2
type: NamedIndividual
type: LSE_Station
hasGeometry: GeoLSEStation2
hosts: LSE g Sensor 2
control area: 1x1 Area
has type of cover: Vineyards
Located in municipality: Caudete de las Fuentes
Located in province: Valencia/València
comment: LSE Station number 2

LSE Station 3
type: NamedIndividual
type: LSE_Station
hasGeometry: GeoLSEStation3
hosts: LSE g Sensor 3
control area: 1x1 Area
has type of cover: Vineyards
Located in municipality: Caudete de las Fuentes
Located in province: Valencia/València
comment: LSE Station number 3

LSE Station 4
type: NamedIndividual
type: LSE_Station
hasGeometry: GeoLSEStation4
hosts: LSE g Sensor 4
control area: 1x1 Area
has type of cover: Vineyards
Located in municipality: Caudete de las Fuentes
Located in province: Valencia/València
comment: LSE Station number 4

LSE Station 5
type: NamedIndividual
type: LSE_Station
hasGeometry: GeoLSEStation5
hosts: LSE g Sensor 5
control area: 1x1 Area
has type of cover: Vineyards
Located in municipality: Caudete de las Fuentes
Located in province: Valencia/València
comment: LSE Station number 5

LSE Station 6
type: NamedIndividual
type: LSE_Station
hasGeometry: GeoLSEStation6
hosts: LSE g Sensor 6
control area: 1x1 Area
has type of cover: Vineyards
Located in municipality: Caudete de las Fuentes
Located in province: Valencia/València
comment: LSE Station number 6

LSE g Sensor 1
type: NamedIndividual
type: LSE g
is hosted by: LSE Station 1
observes: surface longwave emissivity
comment: Sensor LSE_g hosted by LSE_Station_1

LSE g Sensor 2
type: NamedIndividual
type: LSE g
is hosted by: LSE Station 2
observes: surface longwave emissivity
comment: Sensor LSE_g hosted by LSE_Station_2

LSE g Sensor 3
type: NamedIndividual
type: LSE g
is hosted by: LSE Station 3
observes: surface longwave emissivity
comment: Sensor LSE_g hosted by LSE_Station_3

LSE g Sensor 4
type: NamedIndividual
type: LSE g
is hosted by: LSE Station 4
observes: surface longwave emissivity
comment: Sensor LSE_g hosted by LSE_Station_4

LSE g Sensor 5
type: NamedIndividual
type: LSE g
is hosted by: LSE Station 5
observes: surface longwave emissivity
comment: Sensor LSE_g hosted by LSE_Station_5

LSE g Sensor 6
type: NamedIndividual
type: LSE g
is hosted by: LSE Station 6
observes: surface longwave emissivity
comment: Sensor LSE_g hosted by LSE_Station_6

LST 8days 1km a Sensor 1
type: NamedIndividual
type: RS MODIS-Aqua
is hosted by: MODIS-Aqua Product 1
observes: LST
comment: LST_8days_1km_a Sensor hosted by MODIS-Aqua Product_1

LST 8days 1km t Sensor 1
type: NamedIndividual
type: RS MODIS-Terra
is hosted by: MODIS-Terra Product 1
observes: LST
comment: LST_8days_1km_t Sensor hosted by MODIS-TerraProduct_1

LST L8 Sensor 1
type: NamedIndividual
type: RS Landsat-8
is hosted by: Landsat-8 Product 1
observes: LST
comment: LST_L8 Sensor hosted by Landsat-8 Product_1

LST L9 Sensor 1
type: NamedIndividual
type: RS Landsat-9
is hosted by: Landsat-9 Product 1
observes: LST
comment: LST_L9 Sensor hosted by Landsat-9 Product_1

LST S3 Sensor 1
type: NamedIndividual
type: RS Sentinel-3 SLSTR
is hosted by: Sentinel-3 SLSTR Product 1
observes: LST
comment: LST_S3 Sensor hosted by Sentinel-3_SLSTR Product_1

LST Station 1
type: NamedIndividual
type: LST_Station
hasGeometry: GeoLSTStation1
hosts: LST g Sensor 1
control area: 1x1 Area
has type of cover: Vineyards
Located in municipality: Caudete de las Fuentes
Located in province: Valencia/València
comment: LST Station number 1

LST UAV Thermal Sensor 1
type: NamedIndividual
type: RS UAV Thermal
is hosted by: UAV Thermal 1
observes: LST
comment: Sensor LST UAV Thermal hosted by UAV Thermal 1.

LST diary 1km a Sensor 1
type: NamedIndividual
type: RS MODIS-Aqua
is hosted by: MODIS-Aqua Product 1
observes: LST
comment: LST_diary_1km_a Sensor hosted by MODIS-Aqua Product_1

LST diary 1km t Sensor 1
type: NamedIndividual
type: RS MODIS-Terra
is hosted by: MODIS-Terra Product 1
observes: LST
comment: LST_diary_1km_t Sensor hosted by MODIS-TerraProduct_1

LST g Sensor 1
type: NamedIndividual
type: LST g
is hosted by: LST Station 1
observes: LST
comment: LST_g Sensor hosted by LST_Station_1

LW down g RAD Sensor 1
type: NamedIndividual
type: LW down g
is hosted by: RAD Station 1
observes: surface downwelling longwave flux in air
comment: LW_down_g_RAD Sensor hosted by RAD_Station_1

LW up g RAD Sensor 1
type: NamedIndividual
type: LW up g
is hosted by: RAD Station 1
observes: upwelling longwave flux in air
comment: LW_up_g_RAD Sensor hosted by RAD_Station_1

LandCover S2 Sensor 1
type: NamedIndividual
type: RS Sentinel-2
is hosted by: Sentinel-2 Product 1
observes: Landcover
comment: LandCover_S2 Sensor hosted by Sentinel-2 Product_1

Landsat-8 Product 1
type: NamedIndividual
type: Landsat-8_Product
hosts: Chl L8 Sensor 1
hosts: EVI L8 Sensor 1
hosts: FAPAR L8 Sensor 1
hosts: LAI L8 Sensor 1
hosts: LST L8 Sensor 1
hosts: NDVI L8 Sensor 1
hosts: SAVI L8 Sensor 1
hosts: SR L8 Sensor 1
comment: Landsat-8 Product number 1

Landsat-8 Satellite
type: NamedIndividual
type: Landsat-8
comment: Landsat 8 satellite.

Landsat-9 Product 1
type: NamedIndividual
type: Landsat-8_Product
hosts: Chl L9 Sensor 1
hosts: EVI L9 Sensor 1
hosts: FAPAR L9 Sensor 1
hosts: LAI L9 Sensor 1
hosts: LST L9 Sensor 1
hosts: NDVI L9 Sensor 1
hosts: SAVI L9 Sensor 1
hosts: SR L9 Sensor 1
comment: Landsat-9 Product number 1

Landsat-9 Satellite
type: NamedIndividual
type: Landsat-9
comment: Landsat 9 satellite.

METEOSAT Product 1
type: NamedIndividual
type: METEOSAT_Product
hosts: CloudMask METEOSAT Sensor 1
hosts: CloudType METEOSAT Sensor 1
hosts: PWC METEOSAT Sensor 1
comment: METEOSAT Station number 1

METEOSAT Satellite
type: NamedIndividual
type: METEOSAT
comment: Meteosat satellite.

MODIS-Aqua Product 1
type: NamedIndividual
type: MODIS-Aqua_Product
hosts: EVI diary 500m a Sensor 1
hosts: FAPAR 8days 500m a Sensor 1
hosts: LST 8days 1km a Sensor 1
hosts: LST diary 1km a Sensor 1
hosts: NDVI 16days 1km a Sensor 1
hosts: NDVI 16days 250m a Sensor 1
hosts: NDVI 16days 500m a Sensor 1
hosts: NDVI diary 500m a Sensor 1
comment: Modis-Aqua Product number 1

MODIS-Aqua Satellite
type: NamedIndividual
type: MODIS-Aqua
comment: Modis Aqua satellite.

MODIS-Terra Product 1
type: NamedIndividual
type: MODIS-Terra_Product
hosts: EVI diary 500m t Sensor 1
hosts: FAPAR 8days 500m t Sensor 1
hosts: LST 8days 1km t Sensor 1
hosts: LST diary 1km t Sensor 1
hosts: NDVI 16days 1km t Sensor 1
hosts: NDVI 16days 250m t Sensor 1
hosts: NDVI 16days 500m t Sensor 1
hosts: NDVI diary 500m t Sensor 1
comment: MODIS-TerraProduct number 1

MODIS-Terra Satellite
type: NamedIndividual
type: MODIS-Terra
comment: Modis Terra satellite.

N2 Station 1
type: NamedIndividual
type: N2_Station
hasGeometry: GeoN2Station1
hosts: N2 g Sensor 1
control area: 1x1 Area
has type of cover: Vineyards
Located in municipality: Caudete de las Fuentes
Located in province: Valencia/València
comment: N2 Station number 1

N2 g Sensor 1
type: NamedIndividual
type: N2 g
is hosted by: N2 Station 1
observes: Nitrogen_Concentration
comment: N2_g Sensor hosted by N2_Station_1

NDVI 16days 1km a Sensor 1
type: NamedIndividual
type: RS MODIS-Aqua
is hosted by: MODIS-Aqua Product 1
observes: NDVI
comment: NDVI_16days_1km_a Sensor hosted by MODIS-Aqua Product_1

NDVI 16days 1km t Sensor 1
type: NamedIndividual
type: RS MODIS-Terra
is hosted by: MODIS-Terra Product 1
observes: NDVI
comment: NDVI_16days_1km_t Sensor hosted by MODIS-TerraProduct_1

NDVI 16days 250m a Sensor 1
type: NamedIndividual
type: RS MODIS-Aqua
is hosted by: MODIS-Aqua Product 1
observes: NDVI
comment: NDVI_16days_250m_a Sensor hosted by MODIS-Aqua Product_1

NDVI 16days 250m t Sensor 1
type: NamedIndividual
type: RS MODIS-Terra
is hosted by: MODIS-Terra Product 1
observes: NDVI
comment: NDVI_16days_250m_t Sensor hosted by MODIS-TerraProduct_1

NDVI 16days 500m a Sensor 1
type: NamedIndividual
type: RS MODIS-Aqua
is hosted by: MODIS-Aqua Product 1
observes: NDVI
comment: NDVI_16days_500m_a Sensor hosted by MODIS-Aqua Product_1

NDVI 16days 500m t Sensor 1
type: NamedIndividual
type: RS MODIS-Terra
is hosted by: MODIS-Terra Product 1
observes: NDVI
comment: NDVI_16days_500m_t Sensor hosted by MODIS-TerraProduct_1

NDVI L8 Sensor 1
type: NamedIndividual
type: RS Landsat-8
is hosted by: Landsat-8 Product 1
observes: NDVI
comment: NDVI_L8 Sensor hosted by Landsat-8 Product_1

NDVI L9 Sensor 1
type: NamedIndividual
type: RS Landsat-9
is hosted by: Landsat-9 Product 1
observes: NDVI
comment: NDVI_L9 Sensor hosted by Landsat-9 Product_1

NDVI S2 Sensor 1
type: NamedIndividual
type: RS Sentinel-2
is hosted by: Sentinel-2 Product 1
observes: NDVI
comment: NDVI_S2 Sensor hosted by Sentinel-2 Product_1

NDVI UAV Multispectral Sensor 1
type: NamedIndividual
type: RS UAV Multispectral
is hosted by: UAV Multispectral 1
observes: NDVI
comment: Sensor NDVI UAV Multispectral hosted by UAV Multispectral 1.

NDVI diary 500m a Sensor 1
type: NamedIndividual
type: RS MODIS-Aqua
is hosted by: MODIS-Aqua Product 1
observes: NDVI
comment: NDVI_diary_500m_a Sensor hosted by MODIS-Aqua Product_11

NDVI diary 500m t Sensor 1
type: NamedIndividual
type: RS MODIS-Terra
is hosted by: MODIS-Terra Product 1
observes: NDVI
comment: NDVI_diary_500m_t Sensor hosted by MODIS-TerraProduct_1

NDWI UAV Hyperspectral Sensor 1
type: NamedIndividual
type: RS UAV Hyperspectral
is hosted by: UAV Hyperspectral 1
observes: NDWI
comment: Sensor NDWI UAV Hyperspectral hosted by UAV Hyperspectral 1.

NRI UAV Hyperspectral Sensor 1
type: NamedIndividual
type: RS UAV Hyperspectral
is hosted by: UAV Hyperspectral 1
observes: NRI
comment: Sensor NRI UAV Hyperspectral hosted by UAV Hyperspectral 1.

NRI
type: NamedIndividual
type: Vegetation Property
comment: The Nitrogen Reflectance Index (NRI) is a spectral index designed to estimate the nitrogen status of vegetation using reflectance measurements in the visible region. It exploits the sensitivity of chlorophyll‐related absorption features to nitrogen concentration.

Non-irrigated arable land
type: NamedIndividual
type: Land Cover Classes
code CLC: 211
comment: Class Level 3 CORINE Land Cover - CLC

NDWI
type: NamedIndividual
type: Soil Property
is observed by: NRI UAV Hyperspectral Sensor 1
comment: NDWI – Normalized Difference Water Index Estimates leaf water content and moisture conditions using narrowband reflectance in the NIR and SWIR (or Green–NIR). It is sensitive to vegetation water status and widely used in stress detection.

OTCI S3 Sensor 1
type: NamedIndividual
type: RS Sentinel-3 OLCI
is hosted by: Sentinel-3 OLCI Product 1
observes: Chl
comment: OTCI_S3 Sensor hosted by Sentinel-3_OLCI Product_1

Orthophoto UAV RGB Sensor 1
type: NamedIndividual
type: RS UAV RGB
is hosted by: UAV RGB 1
observes: Orthophoto
comment: Sensor Orthophoto UAV RGB hosted by UAV RGB 1.

PWC METEOSAT Sensor 1
type: NamedIndividual
type: RS METEOSAT
is hosted by: METEOSAT Product 1
observes: PWC
comment: PWC_METEOSAT Sensor hosted by METEOSAT_Station_1

Permanently irrigated land
type: NamedIndividual
type: Land Cover Classes
code CLC: 212
comment: Class Level 3 CORINE Land Cover - CLC

Pluviometer AEMET Sensor UTIEL
type: NamedIndividual
type: Pluviometer
is hosted by: AEMET UTIEL Station
observes: precipitation amount
comment: Sensor Pluviometer_AEMET hosted by AEMET_UTIEL_Station

RAD Station 1
type: NamedIndividual
type: RAD_Station
hasGeometry: GeoRADStation1
hosts: I dif g RAD Sensor 1
hosts: I dir g RAD Sensor 1
hosts: LW down g RAD Sensor 1
hosts: LW up g RAD Sensor 1
hosts: RN g RAD Sensor 1
hosts: SW down g RAD Sensor 1
hosts: SW up g RAD Sensor 1
hosts: SurfaceAlbedo g RAD Sensor 1
control area: 1x1 Area
has type of cover: Bare Soils
Located in municipality: Caudete de las Fuentes
Located in province: Valencia/València
comment: RAD Station number 1

RN g RAD Sensor 1
type: NamedIndividual
type: RN g
is hosted by: RAD Station 1
observes: surface net radiation
comment: RN_g_RAD Sensor hosted by RAD_Station_1

Roughness SMOS CATDS Sensor 1
type: NamedIndividual
type: RS SMOS
is hosted by: SMOS Product 1
observes: Surface_roughness
comment: Roughness_SMOS_CATDS Sensor hosted by SMOS Product_1

SAVI L8 Sensor 1
type: NamedIndividual
type: RS Landsat-8
is hosted by: Landsat-8 Product 1
observes: SAVI
comment: SAVI_L8 Sensor hosted by Landsat-8 Product_1

SAVI L9 Sensor 1
type: NamedIndividual
type: RS Landsat-9
is hosted by: Landsat-9 Product 1
observes: SAVI
comment: SAVI_L9 Sensor hosted by Landsat-9 Product_1

SAVI S2 Sensor 1
type: NamedIndividual
type: RS Sentinel-2
is hosted by: Sentinel-2 Product 1
observes: SAVI
comment: SAVI_S2_Sensor hosted by Sentinel-2 Product_1

SAVI UAV Multispectral Sensor 1
type: NamedIndividual
type: RS UAV Multispectral
is hosted by: UAV Multispectral 1
observes: SAVI
comment: Sensor SAVI UAV Multispectral hosted by UAV Multispectral 1.

SMAP Product 1
type: NamedIndividual
type: SMAP_Product
hosts: SM SMAP-S1 3km Sensor 1
hosts: SM SMAP-S1 9km Sensor 1
hosts: SM SMAP 36km Sensor 1
comment: SMAP Product number 1

SMAP Satellite
type: NamedIndividual
type: SMAP
comment: SMAP satellite.

SMOS Product 1
type: NamedIndividual
type: SMOS_Product
hosts: AGB SMOS CATDS Sensor 1
hosts: DroughtIndex SMOS CATDS Sensor 1
hosts: Roughness SMOS CATDS Sensor 1
hosts: SM NRT SMOS ESA Sensor 1
hosts: SM SMOS-IC CATDS Sensor 1
hosts: SM SMOS BEC Sensor 1
hosts: SM SMOS ESA Sensor 1
hosts: SM freeze and Thaw SMOS ESA Sensor 1
comment: SMOS Product number 1

SMOS Satellite
type: NamedIndividual
type: SMOS
comment: SMOS satellite.

SM NRT SMOS ESA Sensor 1
type: NamedIndividual
type: RS SMOS
is hosted by: SMOS Product 1
observes: SM
comment: SM_NRT_SMOS_ESA Sensor hosted by SMOS Product_1

SM S1 Sensor 1
type: NamedIndividual
type: RS Sentinel-1
is hosted by: Sentinel-1 Product 1
observes: SM
comment: SM_S1 Sensor hosted by Sentinel-1 Product_1

SM SMAP-S1 3km Sensor 1
type: NamedIndividual
type: RS SMAP
is hosted by: SMAP Product 1
observes: SM
comment: SM_SMAP-S1_3km Sensor hosted by SMAP Product_1

SM SMAP-S1 9km Sensor 1
type: NamedIndividual
type: RS SMAP
is hosted by: SMAP Product 1
observes: SM
comment: SM_SMAP-S1_9km Sensor hosted by SMAP Product_1

SM SMAP 36km Sensor 1
type: NamedIndividual
type: RS SMAP
is hosted by: SMAP Product 1
observes: SM
comment: SM_SMAP_36km Sensor hosted by SMAP Product_1

SM SMOS-IC CATDS Sensor 1
type: NamedIndividual
type: RS SMOS
is hosted by: SMOS Product 1
observes: SM
comment: SM_SMOS-IC_CATDS Sensor hosted by SMOS Product_1

SM SMOS BEC Sensor 1
type: NamedIndividual
type: RS SMOS
is hosted by: SMOS Product 1
observes: SM
comment: SM_SMOS_BEC Sensor hosted by SMOS Product_1

SM SMOS ESA Sensor 1
type: NamedIndividual
type: RS SMOS
is hosted by: SMOS Product 1
observes: SM
comment: SM_SMOS_ESA Sensor hosted by SMOS Product_1

SM Station 1
type: NamedIndividual
type: SM_Station
hasGeometry: GeoSMStation1
hosts: SM g Sensor 1
control area: 1x1 Area
has type of cover: Bare Soils
Located in municipality: Caudete de las Fuentes
Located in province: Valencia/València
comment: SM Station number 1

SM Station 2
type: NamedIndividual
type: SM_Station
hasGeometry: GeoSMStation2
hosts: SM g Sensor 2
control area: 1x1 Area
has type of cover: Vineyards
Located in municipality: Caudete de las Fuentes
Located in province: Valencia/València
comment: SM Station number 2

SM Station 3
type: NamedIndividual
type: SM_Station
hasGeometry: GeoSMStation3
hosts: SM g Sensor 3
control area: 1x1 Area
has type of cover: Vineyards
Located in municipality: Caudete de las Fuentes
Located in province: Valencia/València
comment: SM Station number 3

SM Station 4
type: NamedIndividual
type: SM_Station
hasGeometry: GeoSMStation4
hosts: SM g Sensor 4
control area: 1x1 Area
has type of cover: Fruit trees and berry plantations (olive, almond)
Located in municipality: Caudete de las Fuentes
Located in province: Valencia/València
comment: SM Station number 4

SM Station 5
type: NamedIndividual
type: SM_Station
hasGeometry: GeoSMStation5
hosts: SM g Sensor 5
control area: 1x1 Area
has type of cover: Vineyards
Located in municipality: Caudete de las Fuentes
Located in province: Valencia/València
comment: SM Station number 5

SM Station 6
type: NamedIndividual
type: SM_Station
hasGeometry: GeoSMStation6
hosts: SM g Sensor 6
control area: 10x10 Area
has type of cover: Sclerophyllous vegetation
Located in municipality: Caudete de las Fuentes
Located in province: Valencia/València
comment: SM Station number 6

SM UAV Microwave Sensor 1
type: NamedIndividual
type: RS UAV Microwave
is hosted by: UAV Microwave 1
observes: SM
comment: Sensor SM UAV Microwave hosted by UAV Microwave 1.

SM freeze and Thaw SMOS ESA Sensor 1
type: NamedIndividual
type: RS SMOS
is hosted by: SMOS Product 1
observes: SM
comment: SM_freeze_and_Thaw_SMOS_ESA Sensor hosted by SMOS Product_1

SM g Sensor 1
type: NamedIndividual
type: SM g
is hosted by: SM Station 1
observes: SM
comment: Sensor SM_g hosted by SM_Station_1

SM g Sensor 2
type: NamedIndividual
type: SM g
is hosted by: SM Station 2
observes: SM
comment: Sensor SM_g hosted by SM_Station_2

SM g Sensor 3
type: NamedIndividual
type: SM g
is hosted by: SM Station 3
observes: SM
comment: Sensor SM_g hosted by SM_Station_3

SM g Sensor 4
type: NamedIndividual
type: SM g
is hosted by: SM Station 4
observes: SM
comment: Sensor SM_g hosted by SM_Station_4

SM g Sensor 5
type: NamedIndividual
type: SM g
is hosted by: SM Station 5
observes: SM
comment: Sensor SM_g hosted by SM_Station_5

SM g Sensor 6
type: NamedIndividual
type: SM g
is hosted by: SM Station 6
observes: SM
comment: Sensor SM_g hosted by SM_Station_6

SR L8 Sensor 1
type: NamedIndividual
type: RS Landsat-8
is hosted by: Landsat-8 Product 1
observes: SR
comment: Sensor SR_L8 hosted by Landsat-8 Product_1

SR L9 Sensor 1
type: NamedIndividual
type: RS Landsat-9
is hosted by: Landsat-9 Product 1
observes: SR
comment: SR_L9 Sensor hosted by Landsat-9 Product_1

SR S2 Sensor 1
type: NamedIndividual
type: RS Sentinel-2
is hosted by: Sentinel-2 Product 1
observes: SR
comment: SR_S2 Sensor hosted by Sentinel-2 Product_1

SR UAV Multispectral Sensor 1
type: NamedIndividual
type: RS UAV Multispectral
is hosted by: UAV Multispectral 1
observes: SR
comment: Sensor SR UAV Multispectral hosted by UAV Multispectral 1.

SW down g RAD Sensor 1
type: NamedIndividual
type: SW down g
is hosted by: RAD Station 1
observes: surface downwelling shortwave flux in air
comment: SW_down_g_RAD Sensor hosted by RAD_Station_1

SW up g RAD Sensor 1
type: NamedIndividual
type: SW up g
is hosted by: RAD Station 1
observes: upwelling shortwave flux in air
comment: Sensor SW_up_g_RAD hosted by RAD_Station_1

Sclerophyllous vegetation
type: NamedIndividual
type: Land Cover Classes
code CLC: 321
comment: Class Level 3 CORINE Land Cover - CLC

Sentinel-1 Product 1
type: NamedIndividual
type: Sentinel-1_Product
hosts: SM S1 Sensor 1
comment: Sentinel-1 Product number 1

Sentinel-1 Satellite
type: NamedIndividual
type: Sentinel-1
comment: Sentinel 1 satellite.

Sentinel-2 Product 1
type: NamedIndividual
type: Sentinel-2_Product
hosts: Chl S2 Sensor 1
hosts: EVI S2 Sensor 1
hosts: FAPAR S2 Sensor 1
hosts: LAI S2 Sensor 1
hosts: LandCover S2 Sensor 1
hosts: NDVI S2 Sensor 1
hosts: SAVI S2 Sensor 1
hosts: SR S2 Sensor 1
comment: Sentinel-2 Product number 1

Sentinel-2 Satellite
type: NamedIndividual
type: Sentinel-2
comment: Sentinel 2 satellite.

Sentinel-3 OLCI Product 1
type: NamedIndividual
type: Sentinel-3_OLCI_Product
hosts: GIFAPAR S3 Sensor 1
hosts: OTCI S3 Sensor 1
comment: Sentinel-3_OLCI Product number 1

Sentinel-3 OLCI Satellite
type: NamedIndividual
type: Sentinel-3_OLCI
comment: Sentinel 3 OLCI satellite.

Sentinel-3 SLSTR Product 1
type: NamedIndividual
type: Sentinel-3_SLSTR_Product
hosts: LST S3 Sensor 1
comment: Sentinel-3_SLSTR Product number 1

Sentinel-3 SLSTR Satellite
type: NamedIndividual
type: Sentinel-3_SLSTR
comment: Sentinel 3 SLSTR satellite.

SurfaceAlbedo g RAD Sensor 1
type: NamedIndividual
type: SurfaceAlbedo_g
is hosted by: RAD Station 1
observes: soil albedo
comment: Sensor SurfaceAlbedo_g_RAD hosted by RAD_Station_1

Thermometer AEMET Sensor UTIEL
type: NamedIndividual
type: Thermometer_AEMET
is hosted by: AEMET UTIEL Station
observes: air temperature
observes: temperature in ground depth 05
observes: temperature in ground depth 20
observes: temperature in ground next ground
comment: Sensor Thermometer_AEMET hosted by AEMET_UTIEL_Station

Thermometer EddyCovariance Sensor 1
type: NamedIndividual
type: Thermometer EddyCovariance
is hosted by: EddyCovariance Station 1
observes: air temperature
comment: Thermometer_EddyCovariance Sensor hosted by EddyCovariance_Station_1

UAV Hyperspectral 1
type: NamedIndividual
type: UAV_Hyperspectral
comment: UAV Hyperspectral platform.

UAV LiDAR 1
type: NamedIndividual
type: UAV_LiDAR
comment: UAV LiDAR platform.

UAV Microwave 1
type: NamedIndividual
type: UAV_Microwave
comment: UAV Microwave platform.

UAV Multispectral 1
type: NamedIndividual
type: UAV_Multispectral
comment: UAV Multispectral platform.

UAV RGB 1
type: NamedIndividual
type: UAV_RGB
comment: UAV RGB platform.

UAV Thermal 1
type: NamedIndividual
type: UAV_Thermal
comment: UAV Thermal platform.

Vineyards
type: NamedIndividual
type: Land Cover Classes
code CLC: 221
comment: Class Level 3 CORINE Land Cover - CLC

WaterVapourFlux g EddyCovariance Sensor 1
type: NamedIndividual
type: WaterVapourFlux g
is hosted by: EddyCovariance Station 1
observes: surface water evaporation flux
comment: Sensor WaterVapourFlux_g_EddyCovariance hosted by EddyCovariance_Station_1

WindVane AEMET Sensor UTIEL
type: NamedIndividual
type: WindVane_AEMET
is hosted by: AEMET UTIEL Station
observes: wind from direction
comment: Sensor WindVane_AEMET hosted by AEMET_UTIEL_Station

WindVane EddyCovariance Sensor 1
type: NamedIndividual
type: WindVane_EddyCovariance
is hosted by: EddyCovariance Station 1
observes: wind from direction
comment: Sensor WindVane_EddyCovariance hosted by EddyCovariance_Station_1

cloud mask
type: NamedIndividual
type: Atmosphere Property
is observed by: CloudMask METEOSAT Sensor 1
comment: A 'cloud mask' in remote sensing refers to a technique or dataset used to identify and delineate areas covered by clouds in an image captured from a satellite or other observation platform. This technique is crucial in remote sensing as clouds can obstruct visibility of the Earth's surface, making it challenging to interpret images and analyze data."

cloud type
type: NamedIndividual
type: Atmosphere Property
is observed by: CloudType METEOSAT Sensor 1
comment: "'Cloud type' in remote sensing refers to the classification or categorization of clouds based on their visual characteristics and structural features observed in satellite or aerial imagery.

PWC
type: NamedIndividual
type: Atmosphere Property
type: Land Atmosphere Interaction Property
is observed by: PWC METEOSAT Sensor 1
comment: Precipitable Water Content (PWC) refers to the amount of water vapor present in a vertical column of the Earth's atmosphere. It is typically expressed in terms of thickness or depth, such as millimeters (mm) or inches (inches), and represents the total depth of liquid water that would result if all the water vapor in the column were condensed and collected.

SR
type: NamedIndividual
type: Vegetation Property
is observed by: SR L8 Sensor 1
is observed by: SR L9 Sensor 1
is observed by: SR S2 Sensor 1
is observed by: SR UAV Multispectral Sensor 1
Source: http://gsp.humboldt.edu/olm/Courses/GSP_216/lessons/Spectral-Enhancements/NDVI.html#:~:text=Simplest%20ratio-based%20index%20is,indicate%20soil%2C%20water%20or%20ice.
comment: Simplest ratio-based index is called the Simple Ratio (SR) or Ratio Vegetation Index (RVI). This index is simply the reflectance in the NIR band divided by the reflectance in the red band. A larger SR value indicates healthy vegetation, while lower values indicate soil, water or ice. SR = Near Infrared / Red

surface net radiation
type: NamedIndividual
type: Radiation Property
is observed by: RN g RAD Sensor 1
comment: Earth's net radiation, sometimes called net flux, is the balance between incoming and outgoing energy at the top of the atmosphere.

temperature in ground depth 05
type: NamedIndividual
type: Soil Property
is observed by: Thermometer AEMET Sensor UTIEL
definition: Subsoil temperature at a depth of 5 cm and corresponding to the 10 minutes prior to the date given by 'fint' (degrees Celsius)
definition: The temperature at any given depth (or in a layer) below the surface of the ground, excluding surficial snow and ice (but not permafrost or soil). For temperatures in surface lying snow and ice, the more specific standard names temperature_in_surface_snow and land_ice_temperature should be used. For temperatures measured or modelled specifically for the soil layer (the near-surface layer where plants sink their roots) the standard name soil_temperature should be used.

temperature in ground depth 20
type: NamedIndividual
type: Soil Property
is observed by: Thermometer AEMET Sensor UTIEL
definition: Subsoil temperature at a depth of 20 cm and corresponding to the 10 minutes prior to the date given by 'fint' (degrees Celsius)
definition: The temperature at any given depth (or in a layer) below the surface of the ground, excluding surficial snow and ice (but not permafrost or soil). For temperatures in surface lying snow and ice, the more specific standard names temperature_in_surface_snow and land_ice_temperature should be used. For temperatures measured or modelled specifically for the soil layer (the near-surface layer where plants sink their roots) the standard name soil_temperature should be used.

temperature in ground next ground
type: NamedIndividual
type: Soil Property
is observed by: Thermometer AEMET Sensor UTIEL
definition: Ground temperature, instantaneous temperature next to the ground and corresponding to the 10 minutes prior to the date given by 'fint' (degrees Celsius)
definition: The temperature at any given depth (or in a layer) below the surface of the ground, excluding surficial snow and ice (but not permafrost or soil). For temperatures in surface lying snow and ice, the more specific standard names temperature_in_surface_snow and land_ice_temperature should be used. For temperatures measured or modelled specifically for the soil layer (the near-surface layer where plants sink their roots) the standard name soil_temperature should be used.

1x1 Area
type: NamedIndividual
type: Control Area
hasGeometry: GeoArea1x1
Located in municipality: Caudete de las Fuentes
Located in province: Valencia/València
comment: A Control Area is a spatially delimited region designated to enable consistent environmental observations, calibration activities, and cross-platform validation. It provides a reference zone where measurements can be collected under controlled or well-characterized conditions. Dimension 1 x1.

10x10 Area
type: NamedIndividual
type: Control Area
hasGeometry: GeoArea10x10
Located in province: Valencia/València
comment: A Control Area is a spatially delimited region designated to enable consistent environmental observations, calibration activities, and cross-platform validation. It provides a reference zone where measurements can be collected under controlled or well-characterized conditions. Dimension 10 x10.

Fruit trees and berry plantations (olive, almond)
type: NamedIndividual
type: Land Cover Classes
code CLC: 222
comment: Class Level 3 CORINE Land Cover - CLC

Caudete de las Fuentes
type: NamedIndividual
type: Municipality
Source: https://sws.geonames.org/

Utiel
type: NamedIndividual
type: Municipality

W3C/OGC Spatial Data on the Web Working Group
type: Agent

W3C/OGC Spatial Data on the Web Working Group
type: Agent

Interval
has beginning: Instant
  in XSD date time stamp: 2017-04-15T00:00:00+00:00
has end: Instant
  in XSD date time stamp: 2017-04-16T00:00:00+00:00

unit: Number
numeric value: 520

numeric value: 40.0

Coverage
description: Spatial topic and spatial applicability may be a named place or a location specified by its geographic coordinates. Temporal topic may be a named period, date, or date range. A jurisdiction may be a named administrative entity or a geographic place to which the resource applies. Recommended practice is to use a controlled vocabulary such as the Getty Thesaurus of Geographic Names [[TGN](https://www.getty.edu/research/tools/vocabulary/tgn/index.html)]. Where appropriate, named places or time periods may be used in preference to numeric identifiers such as sets of coordinates or date ranges.
issued: 1999-07-02
comment: The spatial or temporal topic of the resource, spatial applicability of the resource, or jurisdiction under which the resource is relevant.
note: A [second property](/specifications/dublin-core/dcmi-terms/#http://purl.org/dc/terms/coverage) with the same name as this property has been declared in the [dcterms: namespace](http://purl.org/dc/terms/). See the Introduction to the document [DCMI Metadata Terms](/specifications/dublin-core/dcmi-terms/) for an explanation.

Format
description: Recommended practice is to use a controlled vocabulary where available. For example, for file formats one could use the list of Internet Media Types [[MIME](https://www.iana.org/assignments/media-types/media-types.xhtml)].
issued: 1999-07-02
comment: The file format, physical medium, or dimensions of the resource.
note: A [second property](/specifications/dublin-core/dcmi-terms/#http://purl.org/dc/terms/format) with the same name as this property has been declared in the [dcterms: namespace](http://purl.org/dc/terms/). See the Introduction to the document [DCMI Metadata Terms](/specifications/dublin-core/dcmi-terms/) for an explanation.

Identifier
description: Recommended practice is to identify the resource by means of a string conforming to an identification system.
issued: 1999-07-02
comment: An unambiguous reference to the resource within a given context.
note: A [second property](/specifications/dublin-core/dcmi-terms/#http://purl.org/dc/terms/identifier) with the same name as this property has been declared in the [dcterms: namespace](http://purl.org/dc/terms/). See the Introduction to the document [DCMI Metadata Terms](/specifications/dublin-core/dcmi-terms/) for an explanation.

Language
description: Recommended practice is to use either a non-literal value representing a language from a controlled vocabulary such as ISO 639-2 or ISO 639-3, or a literal value consisting of an IETF Best Current Practice 47 [[IETF-BCP47](https://tools.ietf.org/html/bcp47)] language tag.
issued: 1999-07-02
comment: A language of the resource.
note: A [second property](/specifications/dublin-core/dcmi-terms/#http://purl.org/dc/terms/language) with the same name as this property has been declared in the [dcterms: namespace](http://purl.org/dc/terms/). See the Introduction to the document [DCMI Metadata Terms](/specifications/dublin-core/dcmi-terms/) for an explanation.

Publisher
description: Examples of a Publisher include a person, an organization, or a service. Typically, the name of a Publisher should be used to indicate the entity.
issued: 1999-07-02
comment: An entity responsible for making the resource available.
note: A [second property](/specifications/dublin-core/dcmi-terms/#http://purl.org/dc/terms/publisher) with the same name as this property has been declared in the [dcterms: namespace](http://purl.org/dc/terms/). See the Introduction to the document [DCMI Metadata Terms](/specifications/dublin-core/dcmi-terms/) for an explanation.

Relation
description: Recommended practice is to identify the related resource by means of a URI. If this is not possible or feasible, a string conforming to a formal identification system may be provided.
issued: 1999-07-02
comment: A related resource.
note: A [second property](/specifications/dublin-core/dcmi-terms/#http://purl.org/dc/terms/relation) with the same name as this property has been declared in the [dcterms: namespace](http://purl.org/dc/terms/). See the Introduction to the document [DCMI Metadata Terms](/specifications/dublin-core/dcmi-terms/) for an explanation.

Rights
description: Typically, rights information includes a statement about various property rights associated with the resource, including intellectual property rights.
issued: 1999-07-02
comment: Information about rights held in and over the resource.
note: A [second property](/specifications/dublin-core/dcmi-terms/#http://purl.org/dc/terms/rights) with the same name as this property has been declared in the [dcterms: namespace](http://purl.org/dc/terms/). See the Introduction to the document [DCMI Metadata Terms](/specifications/dublin-core/dcmi-terms/) for an explanation.

Subject
description: Typically, the subject will be represented using keywords, key phrases, or classification codes. Recommended best practice is to use a controlled vocabulary.
issued: 1999-07-02
comment: The topic of the resource.
note: A [second property](/specifications/dublin-core/dcmi-terms/#http://purl.org/dc/terms/subject) with the same name as this property has been declared in the [dcterms: namespace](http://purl.org/dc/terms/). See the Introduction to the document [DCMI Metadata Terms](/specifications/dublin-core/dcmi-terms/) for an explanation.

Type
description: Recommended practice is to use a controlled vocabulary such as the DCMI Type Vocabulary [[DCMI-TYPE](http://dublincore.org/documents/dcmi-type-vocabulary/)]. To describe the file format, physical medium, or dimensions of the resource, use the Format element.
issued: 1999-07-02
comment: The nature or genre of the resource.
note: A [second property](/specifications/dublin-core/dcmi-terms/#http://purl.org/dc/terms/type) with the same name as this property has been declared in the [dcterms: namespace](http://purl.org/dc/terms/). See the Introduction to the document [DCMI Metadata Terms](/specifications/dublin-core/dcmi-terms/) for an explanation.

editorial note
definition: A note for an editor, translator or maintainer of the vocabulary.

hidden label
comment: The range of skos:hiddenLabel is the class of RDF plain literals.
comment: skos:prefLabel, skos:altLabel and skos:hiddenLabel are pairwise disjoint properties.
definition: A lexical label for a resource that should be hidden when generating visual displays of the resource, but should still be accessible to free text search operations.

history note
definition: A note about the past state/use/meaning of a concept.

notation
definition: A notation, also known as classification code, is a string of characters such as "T58.5" or "303.4833" used to uniquely identify a concept within the scope of a given concept scheme.
scope note: By convention, skos:notation is used with a typed literal in the object position of the triple.

Actuatable Property
comment: An actuatable quality (property, characteristic) of a FeatureOfInterest.
example: A window actuator acts by changing the state between a frame and a window. The ability of the window to be opened and closed is its ActuatableProperty.

Actuation
comment: An Actuation carries out an (Actuation) Procedure to change the state of the world using an Actuator.
example: The activity of automatically closing a window if the temperature in a room drops below 20 degree Celsius. The activity is the Actuation and the device that closes the window is the Actuator. The Procedure is the rule, plan, or specification that defines the conditions that triggers the Actuation, here a drop in temperature.

Actuator
comment: A device that is used by, or implements, an (Actuation) Procedure that changes the state of the world.
example: A window actuator for automatic window control, i.e., opening or closing the window.

Procedure
comment: A workflow, protocol, plan, algorithm, or computational method specifying how to make an Observation, create a Sample, or make a change to the state of the world (via an Actuator). A Procedure is re-usable, and might be involved in many Observations, Samplings, or Actuations. It explains the steps to be carried out to arrive at reproducible results.
example: The measured wind speed differs depending on the height of the sensor above the surface, e.g., due to friction. Consequently, procedures for measuring wind speed define a standard height for anemometers above ground, typically 10m for meteorological measures and 2m in Agrometeorology. This definition of height, sensor placement, and so forth are defined by the Procedure.
note: Many observations may be created via the same Procedure, the same way as many tables are assembled using the same instructions (as information objects, not their concrete realization).

Sample
comment: A Sample is the result from an act of Sampling.
comment: Feature which is intended to be representative of a FeatureOfInterest on which Observations may be made.
comment: Physical samples are sometimes known as 'specimens'.
comment: Samples are artifacts of an observational strategy, and have no significant function outside of their role in the observation process. The characteristics of the samples themselves are of little interest, except perhaps to the manager of a sampling campaign. A Sample is intended to sample some FatureOfInterest, so there is an expectation of at least one isSampleOf property. However, in some cases the identity, and even the exact type, of the sampled feature may not be known when observations are made using the sampling features.
example: A 'station' is essentially an identifiable locality where a sensor system or Procedure may be deployed and an observation made. In the context of the observation model, it connotes the 'world in the vicinity of the station', so the observed properties relate to the physical medium at the station, and not to any physical artifact such as a mooring, buoy, benchmark, monument, well, etc.
example: A statistical sample is often designed to be characteristic of an entire population, so that observations can be made regarding the sample that provide a good estimate of the properties of the population.
note: A transient sample, such as a ships-track or flight-line, might be identified and described, but is unlikely to be revisited exactly.

Sampler
comment: A device that is used by, or implements, a Sampling Procedure to create or transform one or more samples.
example: A ball mill, diamond drill, hammer, hypodermic syringe and needle, image Sensor or a soil auger can all act as sampling devices (i.e., be Samplers). However, sometimes the distinction between the Sampler and the Sensor is not evident, as they are packaged as a unit. A Sampler need not be a physical device.

Sampling
comment: An act of Sampling carries out a sampling Procedure to create or transform one or more samples.
example: Crushing a rock sample in a ball mill.
example: Digging a pit through a soil sequence.
example: Dividing a field site into quadrants.
example: Drawing blood from a patient.
example: Drilling an observation well.
example: Establishing a station for environmental monitoring.
example: Registering an image of the landscape.
example: Selecting a subset of a population.
example: Sieving a powder to separate the subset finer than 100-mesh.
example: Splitting a piece of drill-core to create two new samples.
example: Taking a diamond-drill core from a rock outcrop.

has simple result
domain includes: Actuation
domain includes: Observation
domain includes: Sampling
comment: The simple value of an Observation or Actuation or act of Sampling.
example: For instance, the values 23 or true.

phenomenon time
domain includes: Actuation
domain includes: Observation
domain includes: Sampling
range includes: TemporalEntity
comment: The time that the Result of an Observation, Actuation or Sampling applies to the FeatureOfInterest. Not necessarily the same as the resultTime. May be an Interval or an Instant, or some other compound TemporalEntity.

used procedure
domain includes: Actuation
domain includes: Observation
domain includes: Sampling
range includes: Procedure
comment: A relation to link to a re-usable Procedure used in making an Observation, an Actuation, or a Sample, typically through a Sensor, Actuator or Sampler.